[Capstone-buildbot] buildbot failure in Snowman on cs-next-msvc2010-32

buildbot at derevenets.com buildbot at derevenets.com
Sat Dec 17 04:41:50 CET 2016


The Buildbot has detected a failed build on builder cs-next-msvc2010-32 while building Snowman. Full details are available at:
    http://localhost/builders/cs-next-msvc2010-32/builds/205

Buildbot URL: http://localhost/

Buildslave for this Build: win7

Build Reason: The SingleBranchScheduler scheduler named 'cs-next-all' triggered this build
Build Source Stamp: [branch next] 8a0f0a82e3fe4f59e6a277c18768b03f3f91bdad
Blamelist: Nguyen Anh Quynh <aquynh at gmail.com>,mrexodia <mr.exodia.tpodt at gmail.com>

BUILD FAILED: failed compile

Sincerely,
 -The Buildbot



-------------- next part --------------
git version 1.8.1.msysgit.1
>From ssh://nas/~/capstone
 * branch            next       -> FETCH_HEAD
HEAD is now at 8a0f0a8 Merge pull request #830 from mrexodia/next
8a0f0a82e3fe4f59e6a277c18768b03f3f91bdad
-------------- next part --------------
-- The C compiler identification is MSVC 16.0.40219.1

-- The CXX compiler identification is MSVC 16.0.40219.1

-- Check for working C compiler using: Visual Studio 10 2010

-- Check for working C compiler using: Visual Studio 10 2010 -- works

-- Detecting C compiler ABI info

-- Detecting C compiler ABI info - done

-- Check for working CXX compiler using: Visual Studio 10 2010

-- Check for working CXX compiler using: Visual Studio 10 2010 -- works

-- Detecting CXX compiler ABI info

-- Detecting CXX compiler ABI info - done

-- Detecting CXX compile features

-- Detecting CXX compile features - done

Enabling CAPSTONE_ARM_SUPPORT

Enabling CAPSTONE_ARM64_SUPPORT

Enabling CAPSTONE_M68K_SUPPORT

Enabling CAPSTONE_MIPS_SUPPORT

Enabling CAPSTONE_PPC_SUPPORT

Enabling CAPSTONE_SPARC_SUPPORT

Enabling CAPSTONE_SYSZ_SUPPORT

Enabling CAPSTONE_XCORE_SUPPORT

Enabling CAPSTONE_X86_SUPPORT

-- Configuring done

-- Generating done

-- Build files have been written to: C:/yegor/buildslave/cs-next-msvc2010-32/build

-------------- next part --------------
Microsoft (R) Build Engine version 4.6.81.0

[Microsoft .NET Framework, version 4.0.30319.42000]

Copyright (C) Microsoft Corporation. All rights reserved.



Build started 12/17/2016 4:39:43 AM.

Project "C:\yegor\buildslave\cs-next-msvc2010-32\build\ALL_BUILD.vcxproj" on node 1 (default targets).

Project "C:\yegor\buildslave\cs-next-msvc2010-32\build\ALL_BUILD.vcxproj" (1) is building "C:\yegor\buildslave\cs-next-msvc2010-32\build\ZERO_CHECK.vcxproj" (2) on node 1 (default targets).

PrepareForBuild:

  Creating directory "Win32\Debug\ZERO_CHECK\".

  Creating directory "Debug\".

InitializeBuildStatus:

  Creating "Win32\Debug\ZERO_CHECK\ZERO_CHECK.unsuccessfulbuild" because "AlwaysCreate" was specified.

CustomBuild:

  Checking Build System

  CMake does not need to re-run because C:/yegor/buildslave/cs-next-msvc2010-32/build/CMakeFiles/generate.stamp is up-to-date.

FinalizeBuildStatus:

  Deleting file "Win32\Debug\ZERO_CHECK\ZERO_CHECK.unsuccessfulbuild".

  Touching "Win32\Debug\ZERO_CHECK\ZERO_CHECK.lastbuildstate".

Done Building Project "C:\yegor\buildslave\cs-next-msvc2010-32\build\ZERO_CHECK.vcxproj" (default targets).

Project "C:\yegor\buildslave\cs-next-msvc2010-32\build\ALL_BUILD.vcxproj" (1) is building "C:\yegor\buildslave\cs-next-msvc2010-32\build\capstone-shared.vcxproj" (3) on node 1 (default targets).

PrepareForBuild:

  Creating directory "capstone-shared.dir\Debug\".

InitializeBuildStatus:

  Creating "capstone-shared.dir\Debug\capstone-shared.unsuccessfulbuild" because "AlwaysCreate" was specified.

CustomBuild:

  Building Custom Rule C:/yegor/buildslave/cs-next-msvc2010-32/capstone/CMakeLists.txt

  CMake does not need to re-run because C:\yegor\buildslave\cs-next-msvc2010-32\build\CMakeFiles\generate.stamp is up-to-date.

ClCompile:

  C:\Program Files (x86)\Microsoft Visual Studio 10.0\VC\bin\CL.exe /c /I"C:\yegor\buildslave\cs-next-msvc2010-32\capstone\include" /Zi /nologo /W3 /WX- /Od /Ob0 /Oy- /D WIN32 /D _WINDOWS /D _DEBUG /D CAPSTONE_SHARED /D CAPSTONE_ARM_SUPPORT /D CAPSTONE_ARM64_SUPPORT /D CAPSTONE_M68K_SUPPORT /D CAPSTONE_MIPS_SUPPORT /D CAPSTONE_PPC_SUPPORT /D CAPSTONE_SPARC_SUPPORT /D CAPSTONE_SYSZ_SUPPORT /D CAPSTONE_XCORE_SUPPORT /D CAPSTONE_X86_SUPPORT /D CAPSTONE_USE_SYS_DYN_MEM /D CAPSTONE_HAS_ARM /D CAPSTONE_HAS_ARM64 /D CAPSTONE_HAS_MIPS /D CAPSTONE_HAS_POWERPC /D CAPSTONE_HAS_X86 /D CAPSTONE_HAS_SPARC /D CAPSTONE_HAS_SYSZ /D CAPSTONE_HAS_XCORE /D CAPSTONE_HAS_M68K /D "CMAKE_INTDIR=\"Debug\"" /D capstone_shared_EXPORTS /D _WINDLL /D _MBCS /Gm- /RTC1 /MDd /GS /fp:precise /Zc:wchar_t /Zc:forScope /Fo"capstone-shared.dir\Debug\\" /Fd"capstone-shared.dir\Debug\vc100.pdb" /Gd /TC /analyze- /errorReport:queue ..\capstone\cs.c ..\capstone\MCInst.c ..\capstone\MCInstrDesc.c ..\capstone\MCRegisterInfo.c ..\capstone\SStream.c ..\capstone\utils.c ..\capstone\arch\ARM\ARMDisassembler.c ..\capstone\arch\ARM\ARMInstPrinter.c ..\capstone\arch\ARM\ARMMapping.c ..\capstone\arch\ARM\ARMModule.c ..\capstone\arch\AArch64\AArch64BaseInfo.c ..\capstone\arch\AArch64\AArch64Disassembler.c ..\capstone\arch\AArch64\AArch64InstPrinter.c ..\capstone\arch\AArch64\AArch64Mapping.c ..\capstone\arch\AArch64\AArch64Module.c ..\capstone\arch\Mips\MipsDisassembler.c ..\capstone\arch\Mips\MipsInstPrinter.c ..\capstone\arch\Mips\MipsMapping.c ..\capstone\arch\Mips\MipsModule.c ..\capstone\arch\PowerPC\PPCDisassembler.c ..\capstone\arch\PowerPC\PPCInstPrinter.c ..\capstone\arch\PowerPC\PPCMapping.c ..\capstone\arch\PowerPC\PPCModule.c ..\capstone\arch\X86\X86Disassembler.c ..\capstone\arch\X86\X86DisassemblerDecoder.c ..\capstone\arch\X86\X86IntelInstPrinter.c ..\capstone\arch\X86\X86Mapping.c ..\capstone\arch\X86\X86Module.c ..\capstone\arch\X86\X86ATTInstPrinter.c ..\capstone\arch\Sparc\SparcDisassembler.c ..\capstone\arch\Sparc\SparcInstPrinter.c ..\capstone\arch\Sparc\SparcMapping.c ..\capstone\arch\Sparc\SparcModule.c ..\capstone\arch\SystemZ\SystemZDisassembler.c ..\capstone\arch\SystemZ\SystemZInstPrinter.c ..\capstone\arch\SystemZ\SystemZMapping.c ..\capstone\arch\SystemZ\SystemZMCTargetDesc.c ..\capstone\arch\SystemZ\SystemZModule.c ..\capstone\arch\XCore\XCoreDisassembler.c ..\capstone\arch\XCore\XCoreInstPrinter.c ..\capstone\arch\XCore\XCoreMapping.c ..\capstone\arch\XCore\XCoreModule.c ..\capstone\arch\M68K\M68KDisassembler.c ..\capstone\arch\M68K\M68KInstPrinter.c ..\capstone\arch\M68K\M68KModule.c

  cs.c

  MCInst.c

  MCInstrDesc.c

  MCRegisterInfo.c

  SStream.c

  utils.c

  ARMDisassembler.c

  ARMInstPrinter.c

  ARMMapping.c

  ARMModule.c

  AArch64BaseInfo.c

  AArch64Disassembler.c

  AArch64InstPrinter.c

  AArch64Mapping.c

  AArch64Module.c

  MipsDisassembler.c

  MipsInstPrinter.c

  MipsMapping.c

  MipsModule.c

  PPCDisassembler.c

  Generating Code...

  Compiling...

  PPCInstPrinter.c

  PPCMapping.c

  PPCModule.c

  X86Disassembler.c

  X86DisassemblerDecoder.c

  X86IntelInstPrinter.c

  X86Mapping.c

  X86Module.c

  X86ATTInstPrinter.c

  SparcDisassembler.c

  SparcInstPrinter.c

  SparcMapping.c

  SparcModule.c

  SystemZDisassembler.c

  SystemZInstPrinter.c

  SystemZMapping.c

  SystemZMCTargetDesc.c

  SystemZModule.c

  XCoreDisassembler.c

  XCoreInstPrinter.c

  Generating Code...

  Compiling...

  XCoreMapping.c

  XCoreModule.c

  M68KDisassembler.c

  M68KInstPrinter.c

  M68KModule.c

  Generating Code...

ManifestResourceCompile:

  C:\Program Files (x86)\Microsoft SDKs\Windows\v7.0A\bin\rc.exe /nologo /fo"capstone-shared.dir\Debug\capstone.dll.embed.manifest.res" capstone-shared.dir\Debug\capstone_manifest.rc 

Link:

  C:\Program Files (x86)\Microsoft Visual Studio 10.0\VC\bin\link.exe /ERRORREPORT:QUEUE /OUT:"C:\yegor\buildslave\cs-next-msvc2010-32\build\Debug\capstone.dll" /INCREMENTAL /NOLOGO kernel32.lib user32.lib gdi32.lib winspool.lib shell32.lib ole32.lib oleaut32.lib uuid.lib comdlg32.lib advapi32.lib /MANIFEST /ManifestFile:"capstone-shared.dir\Debug\capstone.dll.intermediate.manifest" /MANIFESTUAC:"level='asInvoker' uiAccess='false'" /DEBUG /PDB:"C:/yegor/buildslave/cs-next-msvc2010-32/build/Debug/capstone.pdb" /SUBSYSTEM:CONSOLE /TLBID:1 /DYNAMICBASE /NXCOMPAT /IMPLIB:"C:/yegor/buildslave/cs-next-msvc2010-32/build/Debug/capstone_dll.lib" /MACHINE:X86 /DLL "capstone-shared.dir\Debug\capstone.dll.embed.manifest.res"

  "capstone-shared.dir\Debug\cs.obj"

  "capstone-shared.dir\Debug\MCInst.obj"

  "capstone-shared.dir\Debug\MCInstrDesc.obj"

  "capstone-shared.dir\Debug\MCRegisterInfo.obj"

  "capstone-shared.dir\Debug\SStream.obj"

  "capstone-shared.dir\Debug\utils.obj"

  "capstone-shared.dir\Debug\ARMDisassembler.obj"

  "capstone-shared.dir\Debug\ARMInstPrinter.obj"

  "capstone-shared.dir\Debug\ARMMapping.obj"

  "capstone-shared.dir\Debug\ARMModule.obj"

  "capstone-shared.dir\Debug\AArch64BaseInfo.obj"

  "capstone-shared.dir\Debug\AArch64Disassembler.obj"

  "capstone-shared.dir\Debug\AArch64InstPrinter.obj"

  "capstone-shared.dir\Debug\AArch64Mapping.obj"

  "capstone-shared.dir\Debug\AArch64Module.obj"

  "capstone-shared.dir\Debug\MipsDisassembler.obj"

  "capstone-shared.dir\Debug\MipsInstPrinter.obj"

  "capstone-shared.dir\Debug\MipsMapping.obj"

  "capstone-shared.dir\Debug\MipsModule.obj"

  "capstone-shared.dir\Debug\PPCDisassembler.obj"

  "capstone-shared.dir\Debug\PPCInstPrinter.obj"

  "capstone-shared.dir\Debug\PPCMapping.obj"

  "capstone-shared.dir\Debug\PPCModule.obj"

  "capstone-shared.dir\Debug\X86Disassembler.obj"

  "capstone-shared.dir\Debug\X86DisassemblerDecoder.obj"

  "capstone-shared.dir\Debug\X86IntelInstPrinter.obj"

  "capstone-shared.dir\Debug\X86Mapping.obj"

  "capstone-shared.dir\Debug\X86Module.obj"

  "capstone-shared.dir\Debug\X86ATTInstPrinter.obj"

  "capstone-shared.dir\Debug\SparcDisassembler.obj"

  "capstone-shared.dir\Debug\SparcInstPrinter.obj"

  "capstone-shared.dir\Debug\SparcMapping.obj"

  "capstone-shared.dir\Debug\SparcModule.obj"

  "capstone-shared.dir\Debug\SystemZDisassembler.obj"

  "capstone-shared.dir\Debug\SystemZInstPrinter.obj"

  "capstone-shared.dir\Debug\SystemZMapping.obj"

  "capstone-shared.dir\Debug\SystemZMCTargetDesc.obj"

  "capstone-shared.dir\Debug\SystemZModule.obj"

  "capstone-shared.dir\Debug\XCoreDisassembler.obj"

  "capstone-shared.dir\Debug\XCoreInstPrinter.obj"

  "capstone-shared.dir\Debug\XCoreMapping.obj"

  "capstone-shared.dir\Debug\XCoreModule.obj"

  "capstone-shared.dir\Debug\M68KDisassembler.obj"

  "capstone-shared.dir\Debug\M68KInstPrinter.obj"

  "capstone-shared.dir\Debug\M68KModule.obj"  /machine:X86 /debug 

     Creating library C:/yegor/buildslave/cs-next-msvc2010-32/build/Debug/capstone_dll.lib and object C:/yegor/buildslave/cs-next-msvc2010-32/build/Debug/capstone_dll.exp

Manifest:

  C:\Program Files (x86)\Microsoft SDKs\Windows\v7.0A\bin\mt.exe /nologo /verbose /out:"capstone-shared.dir\Debug\capstone.dll.embed.manifest" /manifest "capstone-shared.dir\Debug\capstone.dll.intermediate.manifest"

  C:\Program Files (x86)\Microsoft SDKs\Windows\v7.0A\bin\rc.exe /nologo /fo"capstone-shared.dir\Debug\capstone.dll.embed.manifest.res" capstone-shared.dir\Debug\capstone_manifest.rc 

LinkEmbedManifest:

  C:\Program Files (x86)\Microsoft Visual Studio 10.0\VC\bin\link.exe /ERRORREPORT:QUEUE /OUT:"C:\yegor\buildslave\cs-next-msvc2010-32\build\Debug\capstone.dll" /INCREMENTAL /NOLOGO kernel32.lib user32.lib gdi32.lib winspool.lib shell32.lib ole32.lib oleaut32.lib uuid.lib comdlg32.lib advapi32.lib /MANIFEST /ManifestFile:"capstone-shared.dir\Debug\capstone.dll.intermediate.manifest" /MANIFESTUAC:"level='asInvoker' uiAccess='false'" /DEBUG /PDB:"C:/yegor/buildslave/cs-next-msvc2010-32/build/Debug/capstone.pdb" /SUBSYSTEM:CONSOLE /TLBID:1 /DYNAMICBASE /NXCOMPAT /IMPLIB:"C:/yegor/buildslave/cs-next-msvc2010-32/build/Debug/capstone_dll.lib" /MACHINE:X86 /DLL "capstone-shared.dir\Debug\capstone.dll.embed.manifest.res"

  "capstone-shared.dir\Debug\cs.obj"

  "capstone-shared.dir\Debug\MCInst.obj"

  "capstone-shared.dir\Debug\MCInstrDesc.obj"

  "capstone-shared.dir\Debug\MCRegisterInfo.obj"

  "capstone-shared.dir\Debug\SStream.obj"

  "capstone-shared.dir\Debug\utils.obj"

  "capstone-shared.dir\Debug\ARMDisassembler.obj"

  "capstone-shared.dir\Debug\ARMInstPrinter.obj"

  "capstone-shared.dir\Debug\ARMMapping.obj"

  "capstone-shared.dir\Debug\ARMModule.obj"

  "capstone-shared.dir\Debug\AArch64BaseInfo.obj"

  "capstone-shared.dir\Debug\AArch64Disassembler.obj"

  "capstone-shared.dir\Debug\AArch64InstPrinter.obj"

  "capstone-shared.dir\Debug\AArch64Mapping.obj"

  "capstone-shared.dir\Debug\AArch64Module.obj"

  "capstone-shared.dir\Debug\MipsDisassembler.obj"

  "capstone-shared.dir\Debug\MipsInstPrinter.obj"

  "capstone-shared.dir\Debug\MipsMapping.obj"

  "capstone-shared.dir\Debug\MipsModule.obj"

  "capstone-shared.dir\Debug\PPCDisassembler.obj"

  "capstone-shared.dir\Debug\PPCInstPrinter.obj"

  "capstone-shared.dir\Debug\PPCMapping.obj"

  "capstone-shared.dir\Debug\PPCModule.obj"

  "capstone-shared.dir\Debug\X86Disassembler.obj"

  "capstone-shared.dir\Debug\X86DisassemblerDecoder.obj"

  "capstone-shared.dir\Debug\X86IntelInstPrinter.obj"

  "capstone-shared.dir\Debug\X86Mapping.obj"

  "capstone-shared.dir\Debug\X86Module.obj"

  "capstone-shared.dir\Debug\X86ATTInstPrinter.obj"

  "capstone-shared.dir\Debug\SparcDisassembler.obj"

  "capstone-shared.dir\Debug\SparcInstPrinter.obj"

  "capstone-shared.dir\Debug\SparcMapping.obj"

  "capstone-shared.dir\Debug\SparcModule.obj"

  "capstone-shared.dir\Debug\SystemZDisassembler.obj"

  "capstone-shared.dir\Debug\SystemZInstPrinter.obj"

  "capstone-shared.dir\Debug\SystemZMapping.obj"

  "capstone-shared.dir\Debug\SystemZMCTargetDesc.obj"

  "capstone-shared.dir\Debug\SystemZModule.obj"

  "capstone-shared.dir\Debug\XCoreDisassembler.obj"

  "capstone-shared.dir\Debug\XCoreInstPrinter.obj"

  "capstone-shared.dir\Debug\XCoreMapping.obj"

  "capstone-shared.dir\Debug\XCoreModule.obj"

  "capstone-shared.dir\Debug\M68KDisassembler.obj"

  "capstone-shared.dir\Debug\M68KInstPrinter.obj"

  "capstone-shared.dir\Debug\M68KModule.obj"  /machine:X86 /debug 

     Creating library C:/yegor/buildslave/cs-next-msvc2010-32/build/Debug/capstone_dll.lib and object C:/yegor/buildslave/cs-next-msvc2010-32/build/Debug/capstone_dll.exp

  capstone-shared.vcxproj -> C:\yegor\buildslave\cs-next-msvc2010-32\build\Debug\capstone.dll

FinalizeBuildStatus:

  Deleting file "capstone-shared.dir\Debug\capstone-shared.unsuccessfulbuild".

  Touching "capstone-shared.dir\Debug\capstone-shared.lastbuildstate".

Done Building Project "C:\yegor\buildslave\cs-next-msvc2010-32\build\capstone-shared.vcxproj" (default targets).

Project "C:\yegor\buildslave\cs-next-msvc2010-32\build\ALL_BUILD.vcxproj" (1) is building "C:\yegor\buildslave\cs-next-msvc2010-32\build\capstone-static.vcxproj" (4) on node 1 (default targets).

PrepareForBuild:

  Creating directory "capstone-static.dir\Debug\".

InitializeBuildStatus:

  Creating "capstone-static.dir\Debug\capstone-static.unsuccessfulbuild" because "AlwaysCreate" was specified.

CustomBuild:

  Building Custom Rule C:/yegor/buildslave/cs-next-msvc2010-32/capstone/CMakeLists.txt

  CMake does not need to re-run because C:\yegor\buildslave\cs-next-msvc2010-32\build\CMakeFiles\generate.stamp is up-to-date.

ClCompile:

  C:\Program Files (x86)\Microsoft Visual Studio 10.0\VC\bin\CL.exe /c /I"C:\yegor\buildslave\cs-next-msvc2010-32\capstone\include" /Zi /nologo /W3 /WX- /Od /Ob0 /Oy- /D WIN32 /D _WINDOWS /D _DEBUG /D CAPSTONE_ARM_SUPPORT /D CAPSTONE_ARM64_SUPPORT /D CAPSTONE_M68K_SUPPORT /D CAPSTONE_MIPS_SUPPORT /D CAPSTONE_PPC_SUPPORT /D CAPSTONE_SPARC_SUPPORT /D CAPSTONE_SYSZ_SUPPORT /D CAPSTONE_XCORE_SUPPORT /D CAPSTONE_X86_SUPPORT /D CAPSTONE_USE_SYS_DYN_MEM /D CAPSTONE_HAS_ARM /D CAPSTONE_HAS_ARM64 /D CAPSTONE_HAS_MIPS /D CAPSTONE_HAS_POWERPC /D CAPSTONE_HAS_X86 /D CAPSTONE_HAS_SPARC /D CAPSTONE_HAS_SYSZ /D CAPSTONE_HAS_XCORE /D CAPSTONE_HAS_M68K /D "CMAKE_INTDIR=\"Debug\"" /D _MBCS /Gm- /RTC1 /MDd /GS /fp:precise /Zc:wchar_t /Zc:forScope /Fo"capstone-static.dir\Debug\\" /Fd"capstone-static.dir\Debug\vc100.pdb" /Gd /TC /analyze- /errorReport:queue ..\capstone\cs.c ..\capstone\MCInst.c ..\capstone\MCInstrDesc.c ..\capstone\MCRegisterInfo.c ..\capstone\SStream.c ..\capstone\utils.c ..\capstone\arch\ARM\ARMDisassembler.c ..\capstone\arch\ARM\ARMInstPrinter.c ..\capstone\arch\ARM\ARMMapping.c ..\capstone\arch\ARM\ARMModule.c ..\capstone\arch\AArch64\AArch64BaseInfo.c ..\capstone\arch\AArch64\AArch64Disassembler.c ..\capstone\arch\AArch64\AArch64InstPrinter.c ..\capstone\arch\AArch64\AArch64Mapping.c ..\capstone\arch\AArch64\AArch64Module.c ..\capstone\arch\Mips\MipsDisassembler.c ..\capstone\arch\Mips\MipsInstPrinter.c ..\capstone\arch\Mips\MipsMapping.c ..\capstone\arch\Mips\MipsModule.c ..\capstone\arch\PowerPC\PPCDisassembler.c ..\capstone\arch\PowerPC\PPCInstPrinter.c ..\capstone\arch\PowerPC\PPCMapping.c ..\capstone\arch\PowerPC\PPCModule.c ..\capstone\arch\X86\X86Disassembler.c ..\capstone\arch\X86\X86DisassemblerDecoder.c ..\capstone\arch\X86\X86IntelInstPrinter.c ..\capstone\arch\X86\X86Mapping.c ..\capstone\arch\X86\X86Module.c ..\capstone\arch\X86\X86ATTInstPrinter.c ..\capstone\arch\Sparc\SparcDisassembler.c ..\capstone\arch\Sparc\SparcInstPrinter.c ..\capstone\arch\Sparc\SparcMapping.c ..\capstone\arch\Sparc\SparcModule.c ..\capstone\arch\SystemZ\SystemZDisassembler.c ..\capstone\arch\SystemZ\SystemZInstPrinter.c ..\capstone\arch\SystemZ\SystemZMapping.c ..\capstone\arch\SystemZ\SystemZMCTargetDesc.c ..\capstone\arch\SystemZ\SystemZModule.c ..\capstone\arch\XCore\XCoreDisassembler.c ..\capstone\arch\XCore\XCoreInstPrinter.c ..\capstone\arch\XCore\XCoreMapping.c ..\capstone\arch\XCore\XCoreModule.c ..\capstone\arch\M68K\M68KDisassembler.c ..\capstone\arch\M68K\M68KInstPrinter.c ..\capstone\arch\M68K\M68KModule.c

  cs.c

  MCInst.c

  MCInstrDesc.c

  MCRegisterInfo.c

  SStream.c

  utils.c

  ARMDisassembler.c

  ARMInstPrinter.c

  ARMMapping.c

  ARMModule.c

  AArch64BaseInfo.c

  AArch64Disassembler.c

  AArch64InstPrinter.c

  AArch64Mapping.c

  AArch64Module.c

  MipsDisassembler.c

  MipsInstPrinter.c

  MipsMapping.c

  MipsModule.c

  PPCDisassembler.c

  Generating Code...

  Compiling...

  PPCInstPrinter.c

  PPCMapping.c

  PPCModule.c

  X86Disassembler.c

  X86DisassemblerDecoder.c

  X86IntelInstPrinter.c

  X86Mapping.c

  X86Module.c

  X86ATTInstPrinter.c

  SparcDisassembler.c

  SparcInstPrinter.c

  SparcMapping.c

  SparcModule.c

  SystemZDisassembler.c

  SystemZInstPrinter.c

  SystemZMapping.c

  SystemZMCTargetDesc.c

  SystemZModule.c

  XCoreDisassembler.c

  XCoreInstPrinter.c

  Generating Code...

  Compiling...

  XCoreMapping.c

  XCoreModule.c

  M68KDisassembler.c

  M68KInstPrinter.c

  M68KModule.c

  Generating Code...

Lib:

  C:\Program Files (x86)\Microsoft Visual Studio 10.0\VC\bin\Lib.exe /OUT:"C:\yegor\buildslave\cs-next-msvc2010-32\build\Debug\capstone.lib" /NOLOGO "capstone-static.dir\Debug\cs.obj"

  "capstone-static.dir\Debug\MCInst.obj"

  "capstone-static.dir\Debug\MCInstrDesc.obj"

  "capstone-static.dir\Debug\MCRegisterInfo.obj"

  "capstone-static.dir\Debug\SStream.obj"

  "capstone-static.dir\Debug\utils.obj"

  "capstone-static.dir\Debug\ARMDisassembler.obj"

  "capstone-static.dir\Debug\ARMInstPrinter.obj"

  "capstone-static.dir\Debug\ARMMapping.obj"

  "capstone-static.dir\Debug\ARMModule.obj"

  "capstone-static.dir\Debug\AArch64BaseInfo.obj"

  "capstone-static.dir\Debug\AArch64Disassembler.obj"

  "capstone-static.dir\Debug\AArch64InstPrinter.obj"

  "capstone-static.dir\Debug\AArch64Mapping.obj"

  "capstone-static.dir\Debug\AArch64Module.obj"

  "capstone-static.dir\Debug\MipsDisassembler.obj"

  "capstone-static.dir\Debug\MipsInstPrinter.obj"

  "capstone-static.dir\Debug\MipsMapping.obj"

  "capstone-static.dir\Debug\MipsModule.obj"

  "capstone-static.dir\Debug\PPCDisassembler.obj"

  "capstone-static.dir\Debug\PPCInstPrinter.obj"

  "capstone-static.dir\Debug\PPCMapping.obj"

  "capstone-static.dir\Debug\PPCModule.obj"

  "capstone-static.dir\Debug\X86Disassembler.obj"

  "capstone-static.dir\Debug\X86DisassemblerDecoder.obj"

  "capstone-static.dir\Debug\X86IntelInstPrinter.obj"

  "capstone-static.dir\Debug\X86Mapping.obj"

  "capstone-static.dir\Debug\X86Module.obj"

  "capstone-static.dir\Debug\X86ATTInstPrinter.obj"

  "capstone-static.dir\Debug\SparcDisassembler.obj"

  "capstone-static.dir\Debug\SparcInstPrinter.obj"

  "capstone-static.dir\Debug\SparcMapping.obj"

  "capstone-static.dir\Debug\SparcModule.obj"

  "capstone-static.dir\Debug\SystemZDisassembler.obj"

  "capstone-static.dir\Debug\SystemZInstPrinter.obj"

  "capstone-static.dir\Debug\SystemZMapping.obj"

  "capstone-static.dir\Debug\SystemZMCTargetDesc.obj"

  "capstone-static.dir\Debug\SystemZModule.obj"

  "capstone-static.dir\Debug\XCoreDisassembler.obj"

  "capstone-static.dir\Debug\XCoreInstPrinter.obj"

  "capstone-static.dir\Debug\XCoreMapping.obj"

  "capstone-static.dir\Debug\XCoreModule.obj"

  "capstone-static.dir\Debug\M68KDisassembler.obj"

  "capstone-static.dir\Debug\M68KInstPrinter.obj"

  "capstone-static.dir\Debug\M68KModule.obj"

  capstone-static.vcxproj -> C:\yegor\buildslave\cs-next-msvc2010-32\build\Debug\capstone.lib

FinalizeBuildStatus:

  Deleting file "capstone-static.dir\Debug\capstone-static.unsuccessfulbuild".

  Touching "capstone-static.dir\Debug\capstone-static.lastbuildstate".

Done Building Project "C:\yegor\buildslave\cs-next-msvc2010-32\build\capstone-static.vcxproj" (default targets).

Project "C:\yegor\buildslave\cs-next-msvc2010-32\build\ALL_BUILD.vcxproj" (1) is building "C:\yegor\buildslave\cs-next-msvc2010-32\build\cstool.vcxproj" (5) on node 1 (default targets).

PrepareForBuild:

  Creating directory "cstool.dir\Debug\".

InitializeBuildStatus:

  Creating "cstool.dir\Debug\cstool.unsuccessfulbuild" because "AlwaysCreate" was specified.

CustomBuild:

  Building Custom Rule C:/yegor/buildslave/cs-next-msvc2010-32/capstone/CMakeLists.txt

  CMake does not need to re-run because C:\yegor\buildslave\cs-next-msvc2010-32\build\CMakeFiles\generate.stamp is up-to-date.

ClCompile:

  C:\Program Files (x86)\Microsoft Visual Studio 10.0\VC\bin\CL.exe /c /I"C:\yegor\buildslave\cs-next-msvc2010-32\capstone\include" /Zi /nologo /W3 /WX- /Od /Ob0 /Oy- /D WIN32 /D _WINDOWS /D _DEBUG /D CAPSTONE_ARM_SUPPORT /D CAPSTONE_ARM64_SUPPORT /D CAPSTONE_M68K_SUPPORT /D CAPSTONE_MIPS_SUPPORT /D CAPSTONE_PPC_SUPPORT /D CAPSTONE_SPARC_SUPPORT /D CAPSTONE_SYSZ_SUPPORT /D CAPSTONE_XCORE_SUPPORT /D CAPSTONE_X86_SUPPORT /D CAPSTONE_USE_SYS_DYN_MEM /D CAPSTONE_HAS_ARM /D CAPSTONE_HAS_ARM64 /D CAPSTONE_HAS_MIPS /D CAPSTONE_HAS_POWERPC /D CAPSTONE_HAS_X86 /D CAPSTONE_HAS_SPARC /D CAPSTONE_HAS_SYSZ /D CAPSTONE_HAS_XCORE /D CAPSTONE_HAS_M68K /D "CMAKE_INTDIR=\"Debug\"" /D _MBCS /Gm- /RTC1 /MDd /GS /fp:precise /Zc:wchar_t /Zc:forScope /Fo"cstool.dir\Debug\\" /Fd"cstool.dir\Debug\vc100.pdb" /Gd /TC /analyze- /errorReport:queue ..\capstone\cstool\cstool.c ..\capstone\cstool\cstool_arm.c ..\capstone\cstool\cstool_arm64.c ..\capstone\cstool\cstool_m68k.c ..\capstone\cstool\cstool_mips.c ..\capstone\cstool\cstool_ppc.c ..\capstone\cstool\cstool_sparc.c ..\capstone\cstool\cstool_systemz.c ..\capstone\cstool\cstool_x86.c ..\capstone\cstool\cstool_xcore.c

  cstool.c

..\capstone\cstool\cstool.c(3): fatal error C1083: Cannot open include file: 'inttypes.h': No such file or directory [C:\yegor\buildslave\cs-next-msvc2010-32\build\cstool.vcxproj]

  cstool_arm.c

  cstool_arm64.c

..\capstone\cstool\cstool_arm64.c(78): error C2275: 'uint8_t' : illegal use of this type as an expression [C:\yegor\buildslave\cs-next-msvc2010-32\build\cstool.vcxproj]

          c:\yegor\buildslave\cs-next-msvc2010-32\capstone\include\capstone\platform.h(45) : see declaration of 'uint8_t'

..\capstone\cstool\cstool_arm64.c(78): error C2146: syntax error : missing ';' before identifier 'access' [C:\yegor\buildslave\cs-next-msvc2010-32\build\cstool.vcxproj]

..\capstone\cstool\cstool_arm64.c(78): error C2065: 'access' : undeclared identifier [C:\yegor\buildslave\cs-next-msvc2010-32\build\cstool.vcxproj]

..\capstone\cstool\cstool_arm64.c(79): error C2065: 'access' : undeclared identifier [C:\yegor\buildslave\cs-next-msvc2010-32\build\cstool.vcxproj]

  cstool_m68k.c

  cstool_mips.c

  cstool_ppc.c

..\capstone\cstool\cstool_ppc.c(4): fatal error C1083: Cannot open include file: 'inttypes.h': No such file or directory [C:\yegor\buildslave\cs-next-msvc2010-32\build\cstool.vcxproj]

  cstool_sparc.c

  cstool_systemz.c

  cstool_x86.c

  cstool_xcore.c

  Generating Code...

Done Building Project "C:\yegor\buildslave\cs-next-msvc2010-32\build\cstool.vcxproj" (default targets) -- FAILED.

Project "C:\yegor\buildslave\cs-next-msvc2010-32\build\ALL_BUILD.vcxproj" (1) is building "C:\yegor\buildslave\cs-next-msvc2010-32\build\test_arm.vcxproj" (6) on node 1 (default targets).

PrepareForBuild:

  Creating directory "test_arm.dir\Debug\".

InitializeBuildStatus:

  Creating "test_arm.dir\Debug\test_arm.unsuccessfulbuild" because "AlwaysCreate" was specified.

CustomBuild:

  Building Custom Rule C:/yegor/buildslave/cs-next-msvc2010-32/capstone/CMakeLists.txt

  CMake does not need to re-run because C:\yegor\buildslave\cs-next-msvc2010-32\build\CMakeFiles\generate.stamp is up-to-date.

ClCompile:

  C:\Program Files (x86)\Microsoft Visual Studio 10.0\VC\bin\CL.exe /c /I"C:\yegor\buildslave\cs-next-msvc2010-32\capstone\include" /Zi /nologo /W3 /WX- /Od /Ob0 /Oy- /D WIN32 /D _WINDOWS /D _DEBUG /D CAPSTONE_ARM_SUPPORT /D CAPSTONE_ARM64_SUPPORT /D CAPSTONE_M68K_SUPPORT /D CAPSTONE_MIPS_SUPPORT /D CAPSTONE_PPC_SUPPORT /D CAPSTONE_SPARC_SUPPORT /D CAPSTONE_SYSZ_SUPPORT /D CAPSTONE_XCORE_SUPPORT /D CAPSTONE_X86_SUPPORT /D CAPSTONE_USE_SYS_DYN_MEM /D CAPSTONE_HAS_ARM /D CAPSTONE_HAS_ARM64 /D CAPSTONE_HAS_MIPS /D CAPSTONE_HAS_POWERPC /D CAPSTONE_HAS_X86 /D CAPSTONE_HAS_SPARC /D CAPSTONE_HAS_SYSZ /D CAPSTONE_HAS_XCORE /D CAPSTONE_HAS_M68K /D "CMAKE_INTDIR=\"Debug\"" /D _MBCS /Gm- /RTC1 /MDd /GS /fp:precise /Zc:wchar_t /Zc:forScope /Fo"test_arm.dir\Debug\\" /Fd"test_arm.dir\Debug\vc100.pdb" /Gd /TC /analyze- /errorReport:queue ..\capstone\tests\test_arm.c

  test_arm.c

ManifestResourceCompile:

  C:\Program Files (x86)\Microsoft SDKs\Windows\v7.0A\bin\rc.exe /nologo /fo"test_arm.dir\Debug\test_arm.exe.embed.manifest.res" test_arm.dir\Debug\test_arm_manifest.rc 

Link:

  C:\Program Files (x86)\Microsoft Visual Studio 10.0\VC\bin\link.exe /ERRORREPORT:QUEUE /OUT:"C:\yegor\buildslave\cs-next-msvc2010-32\build\Debug\test_arm.exe" /INCREMENTAL /NOLOGO kernel32.lib user32.lib gdi32.lib winspool.lib shell32.lib ole32.lib oleaut32.lib uuid.lib comdlg32.lib advapi32.lib Debug\capstone.lib /MANIFEST /ManifestFile:"test_arm.dir\Debug\test_arm.exe.intermediate.manifest" /MANIFESTUAC:"level='asInvoker' uiAccess='false'" /DEBUG /PDB:"C:/yegor/buildslave/cs-next-msvc2010-32/build/Debug/test_arm.pdb" /SUBSYSTEM:CONSOLE /TLBID:1 /DYNAMICBASE /NXCOMPAT /IMPLIB:"C:/yegor/buildslave/cs-next-msvc2010-32/build/Debug/test_arm.lib" /MACHINE:X86 test_arm.dir\Debug\test_arm.exe.embed.manifest.res

  test_arm.dir\Debug\test_arm.obj  /machine:X86 /debug 

Manifest:

  C:\Program Files (x86)\Microsoft SDKs\Windows\v7.0A\bin\mt.exe /nologo /verbose /out:"test_arm.dir\Debug\test_arm.exe.embed.manifest" /manifest test_arm.dir\Debug\test_arm.exe.intermediate.manifest

  C:\Program Files (x86)\Microsoft SDKs\Windows\v7.0A\bin\rc.exe /nologo /fo"test_arm.dir\Debug\test_arm.exe.embed.manifest.res" test_arm.dir\Debug\test_arm_manifest.rc 

LinkEmbedManifest:

  C:\Program Files (x86)\Microsoft Visual Studio 10.0\VC\bin\link.exe /ERRORREPORT:QUEUE /OUT:"C:\yegor\buildslave\cs-next-msvc2010-32\build\Debug\test_arm.exe" /INCREMENTAL /NOLOGO kernel32.lib user32.lib gdi32.lib winspool.lib shell32.lib ole32.lib oleaut32.lib uuid.lib comdlg32.lib advapi32.lib Debug\capstone.lib /MANIFEST /ManifestFile:"test_arm.dir\Debug\test_arm.exe.intermediate.manifest" /MANIFESTUAC:"level='asInvoker' uiAccess='false'" /DEBUG /PDB:"C:/yegor/buildslave/cs-next-msvc2010-32/build/Debug/test_arm.pdb" /SUBSYSTEM:CONSOLE /TLBID:1 /DYNAMICBASE /NXCOMPAT /IMPLIB:"C:/yegor/buildslave/cs-next-msvc2010-32/build/Debug/test_arm.lib" /MACHINE:X86 test_arm.dir\Debug\test_arm.exe.embed.manifest.res

  test_arm.dir\Debug\test_arm.obj  /machine:X86 /debug 

  test_arm.vcxproj -> C:\yegor\buildslave\cs-next-msvc2010-32\build\Debug\test_arm.exe

FinalizeBuildStatus:

  Deleting file "test_arm.dir\Debug\test_arm.unsuccessfulbuild".

  Touching "test_arm.dir\Debug\test_arm.lastbuildstate".

Done Building Project "C:\yegor\buildslave\cs-next-msvc2010-32\build\test_arm.vcxproj" (default targets).

Project "C:\yegor\buildslave\cs-next-msvc2010-32\build\ALL_BUILD.vcxproj" (1) is building "C:\yegor\buildslave\cs-next-msvc2010-32\build\test_arm64.vcxproj" (7) on node 1 (default targets).

PrepareForBuild:

  Creating directory "test_arm64.dir\Debug\".

InitializeBuildStatus:

  Creating "test_arm64.dir\Debug\test_arm64.unsuccessfulbuild" because "AlwaysCreate" was specified.

CustomBuild:

  Building Custom Rule C:/yegor/buildslave/cs-next-msvc2010-32/capstone/CMakeLists.txt

  CMake does not need to re-run because C:\yegor\buildslave\cs-next-msvc2010-32\build\CMakeFiles\generate.stamp is up-to-date.

ClCompile:

  C:\Program Files (x86)\Microsoft Visual Studio 10.0\VC\bin\CL.exe /c /I"C:\yegor\buildslave\cs-next-msvc2010-32\capstone\include" /Zi /nologo /W3 /WX- /Od /Ob0 /Oy- /D WIN32 /D _WINDOWS /D _DEBUG /D CAPSTONE_ARM_SUPPORT /D CAPSTONE_ARM64_SUPPORT /D CAPSTONE_M68K_SUPPORT /D CAPSTONE_MIPS_SUPPORT /D CAPSTONE_PPC_SUPPORT /D CAPSTONE_SPARC_SUPPORT /D CAPSTONE_SYSZ_SUPPORT /D CAPSTONE_XCORE_SUPPORT /D CAPSTONE_X86_SUPPORT /D CAPSTONE_USE_SYS_DYN_MEM /D CAPSTONE_HAS_ARM /D CAPSTONE_HAS_ARM64 /D CAPSTONE_HAS_MIPS /D CAPSTONE_HAS_POWERPC /D CAPSTONE_HAS_X86 /D CAPSTONE_HAS_SPARC /D CAPSTONE_HAS_SYSZ /D CAPSTONE_HAS_XCORE /D CAPSTONE_HAS_M68K /D "CMAKE_INTDIR=\"Debug\"" /D _MBCS /Gm- /RTC1 /MDd /GS /fp:precise /Zc:wchar_t /Zc:forScope /Fo"test_arm64.dir\Debug\\" /Fd"test_arm64.dir\Debug\vc100.pdb" /Gd /TC /analyze- /errorReport:queue ..\capstone\tests\test_arm64.c

  test_arm64.c

..\capstone\tests\test_arm64.c(99): error C2275: 'uint8_t' : illegal use of this type as an expression [C:\yegor\buildslave\cs-next-msvc2010-32\build\test_arm64.vcxproj]

          c:\yegor\buildslave\cs-next-msvc2010-32\capstone\include\capstone\platform.h(45) : see declaration of 'uint8_t'

..\capstone\tests\test_arm64.c(99): error C2146: syntax error : missing ';' before identifier 'access' [C:\yegor\buildslave\cs-next-msvc2010-32\build\test_arm64.vcxproj]

..\capstone\tests\test_arm64.c(99): error C2065: 'access' : undeclared identifier [C:\yegor\buildslave\cs-next-msvc2010-32\build\test_arm64.vcxproj]

..\capstone\tests\test_arm64.c(100): error C2065: 'access' : undeclared identifier [C:\yegor\buildslave\cs-next-msvc2010-32\build\test_arm64.vcxproj]

Done Building Project "C:\yegor\buildslave\cs-next-msvc2010-32\build\test_arm64.vcxproj" (default targets) -- FAILED.

Project "C:\yegor\buildslave\cs-next-msvc2010-32\build\ALL_BUILD.vcxproj" (1) is building "C:\yegor\buildslave\cs-next-msvc2010-32\build\test_arm_regression.vcxproj" (8) on node 1 (default targets).

PrepareForBuild:

  Creating directory "test_arm_regression.dir\Debug\".

InitializeBuildStatus:

  Creating "test_arm_regression.dir\Debug\test_arm_regression.unsuccessfulbuild" because "AlwaysCreate" was specified.

CustomBuild:

  Building Custom Rule C:/yegor/buildslave/cs-next-msvc2010-32/capstone/CMakeLists.txt

  CMake does not need to re-run because C:\yegor\buildslave\cs-next-msvc2010-32\build\CMakeFiles\generate.stamp is up-to-date.

ClCompile:

  C:\Program Files (x86)\Microsoft Visual Studio 10.0\VC\bin\CL.exe /c /I"C:\yegor\buildslave\cs-next-msvc2010-32\capstone\include" /Zi /nologo /W3 /WX- /Od /Ob0 /Oy- /D WIN32 /D _WINDOWS /D _DEBUG /D CAPSTONE_ARM_SUPPORT /D CAPSTONE_ARM64_SUPPORT /D CAPSTONE_M68K_SUPPORT /D CAPSTONE_MIPS_SUPPORT /D CAPSTONE_PPC_SUPPORT /D CAPSTONE_SPARC_SUPPORT /D CAPSTONE_SYSZ_SUPPORT /D CAPSTONE_XCORE_SUPPORT /D CAPSTONE_X86_SUPPORT /D CAPSTONE_USE_SYS_DYN_MEM /D CAPSTONE_HAS_ARM /D CAPSTONE_HAS_ARM64 /D CAPSTONE_HAS_MIPS /D CAPSTONE_HAS_POWERPC /D CAPSTONE_HAS_X86 /D CAPSTONE_HAS_SPARC /D CAPSTONE_HAS_SYSZ /D CAPSTONE_HAS_XCORE /D CAPSTONE_HAS_M68K /D "CMAKE_INTDIR=\"Debug\"" /D _MBCS /Gm- /RTC1 /MDd /GS /fp:precise /Zc:wchar_t /Zc:forScope /Fo"test_arm_regression.dir\Debug\\" /Fd"test_arm_regression.dir\Debug\vc100.pdb" /Gd /TC /analyze- /errorReport:queue ..\capstone\suite\arm\test_arm_regression.c

  test_arm_regression.c

ManifestResourceCompile:

  C:\Program Files (x86)\Microsoft SDKs\Windows\v7.0A\bin\rc.exe /nologo /fo"test_arm_regression.dir\Debug\test_arm_regression.exe.embed.manifest.res" test_arm_regression.dir\Debug\test_arm_regression_manifest.rc 

Link:

  C:\Program Files (x86)\Microsoft Visual Studio 10.0\VC\bin\link.exe /ERRORREPORT:QUEUE /OUT:"C:\yegor\buildslave\cs-next-msvc2010-32\build\Debug\test_arm_regression.exe" /INCREMENTAL /NOLOGO kernel32.lib user32.lib gdi32.lib winspool.lib shell32.lib ole32.lib oleaut32.lib uuid.lib comdlg32.lib advapi32.lib Debug\capstone.lib /MANIFEST /ManifestFile:"test_arm_regression.dir\Debug\test_arm_regression.exe.intermediate.manifest" /MANIFESTUAC:"level='asInvoker' uiAccess='false'" /DEBUG /PDB:"C:/yegor/buildslave/cs-next-msvc2010-32/build/Debug/test_arm_regression.pdb" /SUBSYSTEM:CONSOLE /TLBID:1 /DYNAMICBASE /NXCOMPAT /IMPLIB:"C:/yegor/buildslave/cs-next-msvc2010-32/build/Debug/test_arm_regression.lib" /MACHINE:X86 test_arm_regression.dir\Debug\test_arm_regression.exe.embed.manifest.res

  test_arm_regression.dir\Debug\test_arm_regression.obj  /machine:X86 /debug 

Manifest:

  C:\Program Files (x86)\Microsoft SDKs\Windows\v7.0A\bin\mt.exe /nologo /verbose /out:"test_arm_regression.dir\Debug\test_arm_regression.exe.embed.manifest" /manifest test_arm_regression.dir\Debug\test_arm_regression.exe.intermediate.manifest

  C:\Program Files (x86)\Microsoft SDKs\Windows\v7.0A\bin\rc.exe /nologo /fo"test_arm_regression.dir\Debug\test_arm_regression.exe.embed.manifest.res" test_arm_regression.dir\Debug\test_arm_regression_manifest.rc 

LinkEmbedManifest:

  C:\Program Files (x86)\Microsoft Visual Studio 10.0\VC\bin\link.exe /ERRORREPORT:QUEUE /OUT:"C:\yegor\buildslave\cs-next-msvc2010-32\build\Debug\test_arm_regression.exe" /INCREMENTAL /NOLOGO kernel32.lib user32.lib gdi32.lib winspool.lib shell32.lib ole32.lib oleaut32.lib uuid.lib comdlg32.lib advapi32.lib Debug\capstone.lib /MANIFEST /ManifestFile:"test_arm_regression.dir\Debug\test_arm_regression.exe.intermediate.manifest" /MANIFESTUAC:"level='asInvoker' uiAccess='false'" /DEBUG /PDB:"C:/yegor/buildslave/cs-next-msvc2010-32/build/Debug/test_arm_regression.pdb" /SUBSYSTEM:CONSOLE /TLBID:1 /DYNAMICBASE /NXCOMPAT /IMPLIB:"C:/yegor/buildslave/cs-next-msvc2010-32/build/Debug/test_arm_regression.lib" /MACHINE:X86 test_arm_regression.dir\Debug\test_arm_regression.exe.embed.manifest.res

  test_arm_regression.dir\Debug\test_arm_regression.obj  /machine:X86 /debug 

  test_arm_regression.vcxproj -> C:\yegor\buildslave\cs-next-msvc2010-32\build\Debug\test_arm_regression.exe

FinalizeBuildStatus:

  Deleting file "test_arm_regression.dir\Debug\test_arm_regression.unsuccessfulbuild".

  Touching "test_arm_regression.dir\Debug\test_arm_regression.lastbuildstate".

Done Building Project "C:\yegor\buildslave\cs-next-msvc2010-32\build\test_arm_regression.vcxproj" (default targets).

Project "C:\yegor\buildslave\cs-next-msvc2010-32\build\ALL_BUILD.vcxproj" (1) is building "C:\yegor\buildslave\cs-next-msvc2010-32\build\test_basic.vcxproj" (9) on node 1 (default targets).

PrepareForBuild:

  Creating directory "test_basic.dir\Debug\".

InitializeBuildStatus:

  Creating "test_basic.dir\Debug\test_basic.unsuccessfulbuild" because "AlwaysCreate" was specified.

CustomBuild:

  Building Custom Rule C:/yegor/buildslave/cs-next-msvc2010-32/capstone/CMakeLists.txt

  CMake does not need to re-run because C:\yegor\buildslave\cs-next-msvc2010-32\build\CMakeFiles\generate.stamp is up-to-date.

ClCompile:

  C:\Program Files (x86)\Microsoft Visual Studio 10.0\VC\bin\CL.exe /c /I"C:\yegor\buildslave\cs-next-msvc2010-32\capstone\include" /Zi /nologo /W3 /WX- /Od /Ob0 /Oy- /D WIN32 /D _WINDOWS /D _DEBUG /D CAPSTONE_ARM_SUPPORT /D CAPSTONE_ARM64_SUPPORT /D CAPSTONE_M68K_SUPPORT /D CAPSTONE_MIPS_SUPPORT /D CAPSTONE_PPC_SUPPORT /D CAPSTONE_SPARC_SUPPORT /D CAPSTONE_SYSZ_SUPPORT /D CAPSTONE_XCORE_SUPPORT /D CAPSTONE_X86_SUPPORT /D CAPSTONE_USE_SYS_DYN_MEM /D CAPSTONE_HAS_ARM /D CAPSTONE_HAS_ARM64 /D CAPSTONE_HAS_MIPS /D CAPSTONE_HAS_POWERPC /D CAPSTONE_HAS_X86 /D CAPSTONE_HAS_SPARC /D CAPSTONE_HAS_SYSZ /D CAPSTONE_HAS_XCORE /D CAPSTONE_HAS_M68K /D "CMAKE_INTDIR=\"Debug\"" /D _MBCS /Gm- /RTC1 /MDd /GS /fp:precise /Zc:wchar_t /Zc:forScope /Fo"test_basic.dir\Debug\\" /Fd"test_basic.dir\Debug\vc100.pdb" /Gd /TC /analyze- /errorReport:queue ..\capstone\tests\test_basic.c

  test_basic.c

ManifestResourceCompile:

  C:\Program Files (x86)\Microsoft SDKs\Windows\v7.0A\bin\rc.exe /nologo /fo"test_basic.dir\Debug\test_basic.exe.embed.manifest.res" test_basic.dir\Debug\test_basic_manifest.rc 

Link:

  C:\Program Files (x86)\Microsoft Visual Studio 10.0\VC\bin\link.exe /ERRORREPORT:QUEUE /OUT:"C:\yegor\buildslave\cs-next-msvc2010-32\build\Debug\test_basic.exe" /INCREMENTAL /NOLOGO kernel32.lib user32.lib gdi32.lib winspool.lib shell32.lib ole32.lib oleaut32.lib uuid.lib comdlg32.lib advapi32.lib Debug\capstone.lib /MANIFEST /ManifestFile:"test_basic.dir\Debug\test_basic.exe.intermediate.manifest" /MANIFESTUAC:"level='asInvoker' uiAccess='false'" /DEBUG /PDB:"C:/yegor/buildslave/cs-next-msvc2010-32/build/Debug/test_basic.pdb" /SUBSYSTEM:CONSOLE /TLBID:1 /DYNAMICBASE /NXCOMPAT /IMPLIB:"C:/yegor/buildslave/cs-next-msvc2010-32/build/Debug/test_basic.lib" /MACHINE:X86 test_basic.dir\Debug\test_basic.exe.embed.manifest.res

  test_basic.dir\Debug\test_basic.obj  /machine:X86 /debug 

Manifest:

  C:\Program Files (x86)\Microsoft SDKs\Windows\v7.0A\bin\mt.exe /nologo /verbose /out:"test_basic.dir\Debug\test_basic.exe.embed.manifest" /manifest test_basic.dir\Debug\test_basic.exe.intermediate.manifest

  C:\Program Files (x86)\Microsoft SDKs\Windows\v7.0A\bin\rc.exe /nologo /fo"test_basic.dir\Debug\test_basic.exe.embed.manifest.res" test_basic.dir\Debug\test_basic_manifest.rc 

LinkEmbedManifest:

  C:\Program Files (x86)\Microsoft Visual Studio 10.0\VC\bin\link.exe /ERRORREPORT:QUEUE /OUT:"C:\yegor\buildslave\cs-next-msvc2010-32\build\Debug\test_basic.exe" /INCREMENTAL /NOLOGO kernel32.lib user32.lib gdi32.lib winspool.lib shell32.lib ole32.lib oleaut32.lib uuid.lib comdlg32.lib advapi32.lib Debug\capstone.lib /MANIFEST /ManifestFile:"test_basic.dir\Debug\test_basic.exe.intermediate.manifest" /MANIFESTUAC:"level='asInvoker' uiAccess='false'" /DEBUG /PDB:"C:/yegor/buildslave/cs-next-msvc2010-32/build/Debug/test_basic.pdb" /SUBSYSTEM:CONSOLE /TLBID:1 /DYNAMICBASE /NXCOMPAT /IMPLIB:"C:/yegor/buildslave/cs-next-msvc2010-32/build/Debug/test_basic.lib" /MACHINE:X86 test_basic.dir\Debug\test_basic.exe.embed.manifest.res

  test_basic.dir\Debug\test_basic.obj  /machine:X86 /debug 

  test_basic.vcxproj -> C:\yegor\buildslave\cs-next-msvc2010-32\build\Debug\test_basic.exe

FinalizeBuildStatus:

  Deleting file "test_basic.dir\Debug\test_basic.unsuccessfulbuild".

  Touching "test_basic.dir\Debug\test_basic.lastbuildstate".

Done Building Project "C:\yegor\buildslave\cs-next-msvc2010-32\build\test_basic.vcxproj" (default targets).

Project "C:\yegor\buildslave\cs-next-msvc2010-32\build\ALL_BUILD.vcxproj" (1) is building "C:\yegor\buildslave\cs-next-msvc2010-32\build\test_customized_mnem.vcxproj" (10) on node 1 (default targets).

PrepareForBuild:

  Creating directory "test_customized_mnem.dir\Debug\".

InitializeBuildStatus:

  Creating "test_customized_mnem.dir\Debug\test_customized_mnem.unsuccessfulbuild" because "AlwaysCreate" was specified.

CustomBuild:

  Building Custom Rule C:/yegor/buildslave/cs-next-msvc2010-32/capstone/CMakeLists.txt

  CMake does not need to re-run because C:\yegor\buildslave\cs-next-msvc2010-32\build\CMakeFiles\generate.stamp is up-to-date.

ClCompile:

  C:\Program Files (x86)\Microsoft Visual Studio 10.0\VC\bin\CL.exe /c /I"C:\yegor\buildslave\cs-next-msvc2010-32\capstone\include" /Zi /nologo /W3 /WX- /Od /Ob0 /Oy- /D WIN32 /D _WINDOWS /D _DEBUG /D CAPSTONE_ARM_SUPPORT /D CAPSTONE_ARM64_SUPPORT /D CAPSTONE_M68K_SUPPORT /D CAPSTONE_MIPS_SUPPORT /D CAPSTONE_PPC_SUPPORT /D CAPSTONE_SPARC_SUPPORT /D CAPSTONE_SYSZ_SUPPORT /D CAPSTONE_XCORE_SUPPORT /D CAPSTONE_X86_SUPPORT /D CAPSTONE_USE_SYS_DYN_MEM /D CAPSTONE_HAS_ARM /D CAPSTONE_HAS_ARM64 /D CAPSTONE_HAS_MIPS /D CAPSTONE_HAS_POWERPC /D CAPSTONE_HAS_X86 /D CAPSTONE_HAS_SPARC /D CAPSTONE_HAS_SYSZ /D CAPSTONE_HAS_XCORE /D CAPSTONE_HAS_M68K /D "CMAKE_INTDIR=\"Debug\"" /D _MBCS /Gm- /RTC1 /MDd /GS /fp:precise /Zc:wchar_t /Zc:forScope /Fo"test_customized_mnem.dir\Debug\\" /Fd"test_customized_mnem.dir\Debug\vc100.pdb" /Gd /TC /analyze- /errorReport:queue ..\capstone\tests\test_customized_mnem.c

  test_customized_mnem.c

ManifestResourceCompile:

  C:\Program Files (x86)\Microsoft SDKs\Windows\v7.0A\bin\rc.exe /nologo /fo"test_customized_mnem.dir\Debug\test_customized_mnem.exe.embed.manifest.res" test_customized_mnem.dir\Debug\test_customized_mnem_manifest.rc 

Link:

  C:\Program Files (x86)\Microsoft Visual Studio 10.0\VC\bin\link.exe /ERRORREPORT:QUEUE /OUT:"C:\yegor\buildslave\cs-next-msvc2010-32\build\Debug\test_customized_mnem.exe" /INCREMENTAL /NOLOGO kernel32.lib user32.lib gdi32.lib winspool.lib shell32.lib ole32.lib oleaut32.lib uuid.lib comdlg32.lib advapi32.lib Debug\capstone.lib /MANIFEST /ManifestFile:"test_customized_mnem.dir\Debug\test_customized_mnem.exe.intermediate.manifest" /MANIFESTUAC:"level='asInvoker' uiAccess='false'" /DEBUG /PDB:"C:/yegor/buildslave/cs-next-msvc2010-32/build/Debug/test_customized_mnem.pdb" /SUBSYSTEM:CONSOLE /TLBID:1 /DYNAMICBASE /NXCOMPAT /IMPLIB:"C:/yegor/buildslave/cs-next-msvc2010-32/build/Debug/test_customized_mnem.lib" /MACHINE:X86 test_customized_mnem.dir\Debug\test_customized_mnem.exe.embed.manifest.res

  test_customized_mnem.dir\Debug\test_customized_mnem.obj  /machine:X86 /debug 

Manifest:

  C:\Program Files (x86)\Microsoft SDKs\Windows\v7.0A\bin\mt.exe /nologo /verbose /out:"test_customized_mnem.dir\Debug\test_customized_mnem.exe.embed.manifest" /manifest test_customized_mnem.dir\Debug\test_customized_mnem.exe.intermediate.manifest

  C:\Program Files (x86)\Microsoft SDKs\Windows\v7.0A\bin\rc.exe /nologo /fo"test_customized_mnem.dir\Debug\test_customized_mnem.exe.embed.manifest.res" test_customized_mnem.dir\Debug\test_customized_mnem_manifest.rc 

LinkEmbedManifest:

  C:\Program Files (x86)\Microsoft Visual Studio 10.0\VC\bin\link.exe /ERRORREPORT:QUEUE /OUT:"C:\yegor\buildslave\cs-next-msvc2010-32\build\Debug\test_customized_mnem.exe" /INCREMENTAL /NOLOGO kernel32.lib user32.lib gdi32.lib winspool.lib shell32.lib ole32.lib oleaut32.lib uuid.lib comdlg32.lib advapi32.lib Debug\capstone.lib /MANIFEST /ManifestFile:"test_customized_mnem.dir\Debug\test_customized_mnem.exe.intermediate.manifest" /MANIFESTUAC:"level='asInvoker' uiAccess='false'" /DEBUG /PDB:"C:/yegor/buildslave/cs-next-msvc2010-32/build/Debug/test_customized_mnem.pdb" /SUBSYSTEM:CONSOLE /TLBID:1 /DYNAMICBASE /NXCOMPAT /IMPLIB:"C:/yegor/buildslave/cs-next-msvc2010-32/build/Debug/test_customized_mnem.lib" /MACHINE:X86 test_customized_mnem.dir\Debug\test_customized_mnem.exe.embed.manifest.res

  test_customized_mnem.dir\Debug\test_customized_mnem.obj  /machine:X86 /debug 

  test_customized_mnem.vcxproj -> C:\yegor\buildslave\cs-next-msvc2010-32\build\Debug\test_customized_mnem.exe

FinalizeBuildStatus:

  Deleting file "test_customized_mnem.dir\Debug\test_customized_mnem.unsuccessfulbuild".

  Touching "test_customized_mnem.dir\Debug\test_customized_mnem.lastbuildstate".

Done Building Project "C:\yegor\buildslave\cs-next-msvc2010-32\build\test_customized_mnem.vcxproj" (default targets).

Project "C:\yegor\buildslave\cs-next-msvc2010-32\build\ALL_BUILD.vcxproj" (1) is building "C:\yegor\buildslave\cs-next-msvc2010-32\build\test_detail.vcxproj" (11) on node 1 (default targets).

PrepareForBuild:

  Creating directory "test_detail.dir\Debug\".

InitializeBuildStatus:

  Creating "test_detail.dir\Debug\test_detail.unsuccessfulbuild" because "AlwaysCreate" was specified.

CustomBuild:

  Building Custom Rule C:/yegor/buildslave/cs-next-msvc2010-32/capstone/CMakeLists.txt

  CMake does not need to re-run because C:\yegor\buildslave\cs-next-msvc2010-32\build\CMakeFiles\generate.stamp is up-to-date.

ClCompile:

  C:\Program Files (x86)\Microsoft Visual Studio 10.0\VC\bin\CL.exe /c /I"C:\yegor\buildslave\cs-next-msvc2010-32\capstone\include" /Zi /nologo /W3 /WX- /Od /Ob0 /Oy- /D WIN32 /D _WINDOWS /D _DEBUG /D CAPSTONE_ARM_SUPPORT /D CAPSTONE_ARM64_SUPPORT /D CAPSTONE_M68K_SUPPORT /D CAPSTONE_MIPS_SUPPORT /D CAPSTONE_PPC_SUPPORT /D CAPSTONE_SPARC_SUPPORT /D CAPSTONE_SYSZ_SUPPORT /D CAPSTONE_XCORE_SUPPORT /D CAPSTONE_X86_SUPPORT /D CAPSTONE_USE_SYS_DYN_MEM /D CAPSTONE_HAS_ARM /D CAPSTONE_HAS_ARM64 /D CAPSTONE_HAS_MIPS /D CAPSTONE_HAS_POWERPC /D CAPSTONE_HAS_X86 /D CAPSTONE_HAS_SPARC /D CAPSTONE_HAS_SYSZ /D CAPSTONE_HAS_XCORE /D CAPSTONE_HAS_M68K /D "CMAKE_INTDIR=\"Debug\"" /D _MBCS /Gm- /RTC1 /MDd /GS /fp:precise /Zc:wchar_t /Zc:forScope /Fo"test_detail.dir\Debug\\" /Fd"test_detail.dir\Debug\vc100.pdb" /Gd /TC /analyze- /errorReport:queue ..\capstone\tests\test_detail.c

  test_detail.c

ManifestResourceCompile:

  C:\Program Files (x86)\Microsoft SDKs\Windows\v7.0A\bin\rc.exe /nologo /fo"test_detail.dir\Debug\test_detail.exe.embed.manifest.res" test_detail.dir\Debug\test_detail_manifest.rc 

Link:

  C:\Program Files (x86)\Microsoft Visual Studio 10.0\VC\bin\link.exe /ERRORREPORT:QUEUE /OUT:"C:\yegor\buildslave\cs-next-msvc2010-32\build\Debug\test_detail.exe" /INCREMENTAL /NOLOGO kernel32.lib user32.lib gdi32.lib winspool.lib shell32.lib ole32.lib oleaut32.lib uuid.lib comdlg32.lib advapi32.lib Debug\capstone.lib /MANIFEST /ManifestFile:"test_detail.dir\Debug\test_detail.exe.intermediate.manifest" /MANIFESTUAC:"level='asInvoker' uiAccess='false'" /DEBUG /PDB:"C:/yegor/buildslave/cs-next-msvc2010-32/build/Debug/test_detail.pdb" /SUBSYSTEM:CONSOLE /TLBID:1 /DYNAMICBASE /NXCOMPAT /IMPLIB:"C:/yegor/buildslave/cs-next-msvc2010-32/build/Debug/test_detail.lib" /MACHINE:X86 test_detail.dir\Debug\test_detail.exe.embed.manifest.res

  test_detail.dir\Debug\test_detail.obj  /machine:X86 /debug 

Manifest:

  C:\Program Files (x86)\Microsoft SDKs\Windows\v7.0A\bin\mt.exe /nologo /verbose /out:"test_detail.dir\Debug\test_detail.exe.embed.manifest" /manifest test_detail.dir\Debug\test_detail.exe.intermediate.manifest

  C:\Program Files (x86)\Microsoft SDKs\Windows\v7.0A\bin\rc.exe /nologo /fo"test_detail.dir\Debug\test_detail.exe.embed.manifest.res" test_detail.dir\Debug\test_detail_manifest.rc 

LinkEmbedManifest:

  C:\Program Files (x86)\Microsoft Visual Studio 10.0\VC\bin\link.exe /ERRORREPORT:QUEUE /OUT:"C:\yegor\buildslave\cs-next-msvc2010-32\build\Debug\test_detail.exe" /INCREMENTAL /NOLOGO kernel32.lib user32.lib gdi32.lib winspool.lib shell32.lib ole32.lib oleaut32.lib uuid.lib comdlg32.lib advapi32.lib Debug\capstone.lib /MANIFEST /ManifestFile:"test_detail.dir\Debug\test_detail.exe.intermediate.manifest" /MANIFESTUAC:"level='asInvoker' uiAccess='false'" /DEBUG /PDB:"C:/yegor/buildslave/cs-next-msvc2010-32/build/Debug/test_detail.pdb" /SUBSYSTEM:CONSOLE /TLBID:1 /DYNAMICBASE /NXCOMPAT /IMPLIB:"C:/yegor/buildslave/cs-next-msvc2010-32/build/Debug/test_detail.lib" /MACHINE:X86 test_detail.dir\Debug\test_detail.exe.embed.manifest.res

  test_detail.dir\Debug\test_detail.obj  /machine:X86 /debug 

  test_detail.vcxproj -> C:\yegor\buildslave\cs-next-msvc2010-32\build\Debug\test_detail.exe

FinalizeBuildStatus:

  Deleting file "test_detail.dir\Debug\test_detail.unsuccessfulbuild".

  Touching "test_detail.dir\Debug\test_detail.lastbuildstate".

Done Building Project "C:\yegor\buildslave\cs-next-msvc2010-32\build\test_detail.vcxproj" (default targets).

Project "C:\yegor\buildslave\cs-next-msvc2010-32\build\ALL_BUILD.vcxproj" (1) is building "C:\yegor\buildslave\cs-next-msvc2010-32\build\test_iter.vcxproj" (12) on node 1 (default targets).

PrepareForBuild:

  Creating directory "test_iter.dir\Debug\".

InitializeBuildStatus:

  Creating "test_iter.dir\Debug\test_iter.unsuccessfulbuild" because "AlwaysCreate" was specified.

CustomBuild:

  Building Custom Rule C:/yegor/buildslave/cs-next-msvc2010-32/capstone/CMakeLists.txt

  CMake does not need to re-run because C:\yegor\buildslave\cs-next-msvc2010-32\build\CMakeFiles\generate.stamp is up-to-date.

ClCompile:

  C:\Program Files (x86)\Microsoft Visual Studio 10.0\VC\bin\CL.exe /c /I"C:\yegor\buildslave\cs-next-msvc2010-32\capstone\include" /Zi /nologo /W3 /WX- /Od /Ob0 /Oy- /D WIN32 /D _WINDOWS /D _DEBUG /D CAPSTONE_ARM_SUPPORT /D CAPSTONE_ARM64_SUPPORT /D CAPSTONE_M68K_SUPPORT /D CAPSTONE_MIPS_SUPPORT /D CAPSTONE_PPC_SUPPORT /D CAPSTONE_SPARC_SUPPORT /D CAPSTONE_SYSZ_SUPPORT /D CAPSTONE_XCORE_SUPPORT /D CAPSTONE_X86_SUPPORT /D CAPSTONE_USE_SYS_DYN_MEM /D CAPSTONE_HAS_ARM /D CAPSTONE_HAS_ARM64 /D CAPSTONE_HAS_MIPS /D CAPSTONE_HAS_POWERPC /D CAPSTONE_HAS_X86 /D CAPSTONE_HAS_SPARC /D CAPSTONE_HAS_SYSZ /D CAPSTONE_HAS_XCORE /D CAPSTONE_HAS_M68K /D "CMAKE_INTDIR=\"Debug\"" /D _MBCS /Gm- /RTC1 /MDd /GS /fp:precise /Zc:wchar_t /Zc:forScope /Fo"test_iter.dir\Debug\\" /Fd"test_iter.dir\Debug\vc100.pdb" /Gd /TC /analyze- /errorReport:queue ..\capstone\tests\test_iter.c

  test_iter.c

ManifestResourceCompile:

  C:\Program Files (x86)\Microsoft SDKs\Windows\v7.0A\bin\rc.exe /nologo /fo"test_iter.dir\Debug\test_iter.exe.embed.manifest.res" test_iter.dir\Debug\test_iter_manifest.rc 

Link:

  C:\Program Files (x86)\Microsoft Visual Studio 10.0\VC\bin\link.exe /ERRORREPORT:QUEUE /OUT:"C:\yegor\buildslave\cs-next-msvc2010-32\build\Debug\test_iter.exe" /INCREMENTAL /NOLOGO kernel32.lib user32.lib gdi32.lib winspool.lib shell32.lib ole32.lib oleaut32.lib uuid.lib comdlg32.lib advapi32.lib Debug\capstone.lib /MANIFEST /ManifestFile:"test_iter.dir\Debug\test_iter.exe.intermediate.manifest" /MANIFESTUAC:"level='asInvoker' uiAccess='false'" /DEBUG /PDB:"C:/yegor/buildslave/cs-next-msvc2010-32/build/Debug/test_iter.pdb" /SUBSYSTEM:CONSOLE /TLBID:1 /DYNAMICBASE /NXCOMPAT /IMPLIB:"C:/yegor/buildslave/cs-next-msvc2010-32/build/Debug/test_iter.lib" /MACHINE:X86 test_iter.dir\Debug\test_iter.exe.embed.manifest.res

  test_iter.dir\Debug\test_iter.obj  /machine:X86 /debug 

Manifest:

  C:\Program Files (x86)\Microsoft SDKs\Windows\v7.0A\bin\mt.exe /nologo /verbose /out:"test_iter.dir\Debug\test_iter.exe.embed.manifest" /manifest test_iter.dir\Debug\test_iter.exe.intermediate.manifest

  C:\Program Files (x86)\Microsoft SDKs\Windows\v7.0A\bin\rc.exe /nologo /fo"test_iter.dir\Debug\test_iter.exe.embed.manifest.res" test_iter.dir\Debug\test_iter_manifest.rc 

LinkEmbedManifest:

  C:\Program Files (x86)\Microsoft Visual Studio 10.0\VC\bin\link.exe /ERRORREPORT:QUEUE /OUT:"C:\yegor\buildslave\cs-next-msvc2010-32\build\Debug\test_iter.exe" /INCREMENTAL /NOLOGO kernel32.lib user32.lib gdi32.lib winspool.lib shell32.lib ole32.lib oleaut32.lib uuid.lib comdlg32.lib advapi32.lib Debug\capstone.lib /MANIFEST /ManifestFile:"test_iter.dir\Debug\test_iter.exe.intermediate.manifest" /MANIFESTUAC:"level='asInvoker' uiAccess='false'" /DEBUG /PDB:"C:/yegor/buildslave/cs-next-msvc2010-32/build/Debug/test_iter.pdb" /SUBSYSTEM:CONSOLE /TLBID:1 /DYNAMICBASE /NXCOMPAT /IMPLIB:"C:/yegor/buildslave/cs-next-msvc2010-32/build/Debug/test_iter.lib" /MACHINE:X86 test_iter.dir\Debug\test_iter.exe.embed.manifest.res

  test_iter.dir\Debug\test_iter.obj  /machine:X86 /debug 

  test_iter.vcxproj -> C:\yegor\buildslave\cs-next-msvc2010-32\build\Debug\test_iter.exe

FinalizeBuildStatus:

  Deleting file "test_iter.dir\Debug\test_iter.unsuccessfulbuild".

  Touching "test_iter.dir\Debug\test_iter.lastbuildstate".

Done Building Project "C:\yegor\buildslave\cs-next-msvc2010-32\build\test_iter.vcxproj" (default targets).

Project "C:\yegor\buildslave\cs-next-msvc2010-32\build\ALL_BUILD.vcxproj" (1) is building "C:\yegor\buildslave\cs-next-msvc2010-32\build\test_m68k.vcxproj" (13) on node 1 (default targets).

PrepareForBuild:

  Creating directory "test_m68k.dir\Debug\".

InitializeBuildStatus:

  Creating "test_m68k.dir\Debug\test_m68k.unsuccessfulbuild" because "AlwaysCreate" was specified.

CustomBuild:

  Building Custom Rule C:/yegor/buildslave/cs-next-msvc2010-32/capstone/CMakeLists.txt

  CMake does not need to re-run because C:\yegor\buildslave\cs-next-msvc2010-32\build\CMakeFiles\generate.stamp is up-to-date.

ClCompile:

  C:\Program Files (x86)\Microsoft Visual Studio 10.0\VC\bin\CL.exe /c /I"C:\yegor\buildslave\cs-next-msvc2010-32\capstone\include" /Zi /nologo /W3 /WX- /Od /Ob0 /Oy- /D WIN32 /D _WINDOWS /D _DEBUG /D CAPSTONE_ARM_SUPPORT /D CAPSTONE_ARM64_SUPPORT /D CAPSTONE_M68K_SUPPORT /D CAPSTONE_MIPS_SUPPORT /D CAPSTONE_PPC_SUPPORT /D CAPSTONE_SPARC_SUPPORT /D CAPSTONE_SYSZ_SUPPORT /D CAPSTONE_XCORE_SUPPORT /D CAPSTONE_X86_SUPPORT /D CAPSTONE_USE_SYS_DYN_MEM /D CAPSTONE_HAS_ARM /D CAPSTONE_HAS_ARM64 /D CAPSTONE_HAS_MIPS /D CAPSTONE_HAS_POWERPC /D CAPSTONE_HAS_X86 /D CAPSTONE_HAS_SPARC /D CAPSTONE_HAS_SYSZ /D CAPSTONE_HAS_XCORE /D CAPSTONE_HAS_M68K /D "CMAKE_INTDIR=\"Debug\"" /D _MBCS /Gm- /RTC1 /MDd /GS /fp:precise /Zc:wchar_t /Zc:forScope /Fo"test_m68k.dir\Debug\\" /Fd"test_m68k.dir\Debug\vc100.pdb" /Gd /TC /analyze- /errorReport:queue ..\capstone\tests\test_m68k.c

  test_m68k.c

ManifestResourceCompile:

  C:\Program Files (x86)\Microsoft SDKs\Windows\v7.0A\bin\rc.exe /nologo /fo"test_m68k.dir\Debug\test_m68k.exe.embed.manifest.res" test_m68k.dir\Debug\test_m68k_manifest.rc 

Link:

  C:\Program Files (x86)\Microsoft Visual Studio 10.0\VC\bin\link.exe /ERRORREPORT:QUEUE /OUT:"C:\yegor\buildslave\cs-next-msvc2010-32\build\Debug\test_m68k.exe" /INCREMENTAL /NOLOGO kernel32.lib user32.lib gdi32.lib winspool.lib shell32.lib ole32.lib oleaut32.lib uuid.lib comdlg32.lib advapi32.lib Debug\capstone.lib /MANIFEST /ManifestFile:"test_m68k.dir\Debug\test_m68k.exe.intermediate.manifest" /MANIFESTUAC:"level='asInvoker' uiAccess='false'" /DEBUG /PDB:"C:/yegor/buildslave/cs-next-msvc2010-32/build/Debug/test_m68k.pdb" /SUBSYSTEM:CONSOLE /TLBID:1 /DYNAMICBASE /NXCOMPAT /IMPLIB:"C:/yegor/buildslave/cs-next-msvc2010-32/build/Debug/test_m68k.lib" /MACHINE:X86 test_m68k.dir\Debug\test_m68k.exe.embed.manifest.res

  test_m68k.dir\Debug\test_m68k.obj  /machine:X86 /debug 

Manifest:

  C:\Program Files (x86)\Microsoft SDKs\Windows\v7.0A\bin\mt.exe /nologo /verbose /out:"test_m68k.dir\Debug\test_m68k.exe.embed.manifest" /manifest test_m68k.dir\Debug\test_m68k.exe.intermediate.manifest

  C:\Program Files (x86)\Microsoft SDKs\Windows\v7.0A\bin\rc.exe /nologo /fo"test_m68k.dir\Debug\test_m68k.exe.embed.manifest.res" test_m68k.dir\Debug\test_m68k_manifest.rc 

LinkEmbedManifest:

  C:\Program Files (x86)\Microsoft Visual Studio 10.0\VC\bin\link.exe /ERRORREPORT:QUEUE /OUT:"C:\yegor\buildslave\cs-next-msvc2010-32\build\Debug\test_m68k.exe" /INCREMENTAL /NOLOGO kernel32.lib user32.lib gdi32.lib winspool.lib shell32.lib ole32.lib oleaut32.lib uuid.lib comdlg32.lib advapi32.lib Debug\capstone.lib /MANIFEST /ManifestFile:"test_m68k.dir\Debug\test_m68k.exe.intermediate.manifest" /MANIFESTUAC:"level='asInvoker' uiAccess='false'" /DEBUG /PDB:"C:/yegor/buildslave/cs-next-msvc2010-32/build/Debug/test_m68k.pdb" /SUBSYSTEM:CONSOLE /TLBID:1 /DYNAMICBASE /NXCOMPAT /IMPLIB:"C:/yegor/buildslave/cs-next-msvc2010-32/build/Debug/test_m68k.lib" /MACHINE:X86 test_m68k.dir\Debug\test_m68k.exe.embed.manifest.res

  test_m68k.dir\Debug\test_m68k.obj  /machine:X86 /debug 

  test_m68k.vcxproj -> C:\yegor\buildslave\cs-next-msvc2010-32\build\Debug\test_m68k.exe

FinalizeBuildStatus:

  Deleting file "test_m68k.dir\Debug\test_m68k.unsuccessfulbuild".

  Touching "test_m68k.dir\Debug\test_m68k.lastbuildstate".

Done Building Project "C:\yegor\buildslave\cs-next-msvc2010-32\build\test_m68k.vcxproj" (default targets).

Project "C:\yegor\buildslave\cs-next-msvc2010-32\build\ALL_BUILD.vcxproj" (1) is building "C:\yegor\buildslave\cs-next-msvc2010-32\build\test_mips.vcxproj" (14) on node 1 (default targets).

PrepareForBuild:

  Creating directory "test_mips.dir\Debug\".

InitializeBuildStatus:

  Creating "test_mips.dir\Debug\test_mips.unsuccessfulbuild" because "AlwaysCreate" was specified.

CustomBuild:

  Building Custom Rule C:/yegor/buildslave/cs-next-msvc2010-32/capstone/CMakeLists.txt

  CMake does not need to re-run because C:\yegor\buildslave\cs-next-msvc2010-32\build\CMakeFiles\generate.stamp is up-to-date.

ClCompile:

  C:\Program Files (x86)\Microsoft Visual Studio 10.0\VC\bin\CL.exe /c /I"C:\yegor\buildslave\cs-next-msvc2010-32\capstone\include" /Zi /nologo /W3 /WX- /Od /Ob0 /Oy- /D WIN32 /D _WINDOWS /D _DEBUG /D CAPSTONE_ARM_SUPPORT /D CAPSTONE_ARM64_SUPPORT /D CAPSTONE_M68K_SUPPORT /D CAPSTONE_MIPS_SUPPORT /D CAPSTONE_PPC_SUPPORT /D CAPSTONE_SPARC_SUPPORT /D CAPSTONE_SYSZ_SUPPORT /D CAPSTONE_XCORE_SUPPORT /D CAPSTONE_X86_SUPPORT /D CAPSTONE_USE_SYS_DYN_MEM /D CAPSTONE_HAS_ARM /D CAPSTONE_HAS_ARM64 /D CAPSTONE_HAS_MIPS /D CAPSTONE_HAS_POWERPC /D CAPSTONE_HAS_X86 /D CAPSTONE_HAS_SPARC /D CAPSTONE_HAS_SYSZ /D CAPSTONE_HAS_XCORE /D CAPSTONE_HAS_M68K /D "CMAKE_INTDIR=\"Debug\"" /D _MBCS /Gm- /RTC1 /MDd /GS /fp:precise /Zc:wchar_t /Zc:forScope /Fo"test_mips.dir\Debug\\" /Fd"test_mips.dir\Debug\vc100.pdb" /Gd /TC /analyze- /errorReport:queue ..\capstone\tests\test_mips.c

  test_mips.c

ManifestResourceCompile:

  C:\Program Files (x86)\Microsoft SDKs\Windows\v7.0A\bin\rc.exe /nologo /fo"test_mips.dir\Debug\test_mips.exe.embed.manifest.res" test_mips.dir\Debug\test_mips_manifest.rc 

Link:

  C:\Program Files (x86)\Microsoft Visual Studio 10.0\VC\bin\link.exe /ERRORREPORT:QUEUE /OUT:"C:\yegor\buildslave\cs-next-msvc2010-32\build\Debug\test_mips.exe" /INCREMENTAL /NOLOGO kernel32.lib user32.lib gdi32.lib winspool.lib shell32.lib ole32.lib oleaut32.lib uuid.lib comdlg32.lib advapi32.lib Debug\capstone.lib /MANIFEST /ManifestFile:"test_mips.dir\Debug\test_mips.exe.intermediate.manifest" /MANIFESTUAC:"level='asInvoker' uiAccess='false'" /DEBUG /PDB:"C:/yegor/buildslave/cs-next-msvc2010-32/build/Debug/test_mips.pdb" /SUBSYSTEM:CONSOLE /TLBID:1 /DYNAMICBASE /NXCOMPAT /IMPLIB:"C:/yegor/buildslave/cs-next-msvc2010-32/build/Debug/test_mips.lib" /MACHINE:X86 test_mips.dir\Debug\test_mips.exe.embed.manifest.res

  test_mips.dir\Debug\test_mips.obj  /machine:X86 /debug 

Manifest:

  C:\Program Files (x86)\Microsoft SDKs\Windows\v7.0A\bin\mt.exe /nologo /verbose /out:"test_mips.dir\Debug\test_mips.exe.embed.manifest" /manifest test_mips.dir\Debug\test_mips.exe.intermediate.manifest

  C:\Program Files (x86)\Microsoft SDKs\Windows\v7.0A\bin\rc.exe /nologo /fo"test_mips.dir\Debug\test_mips.exe.embed.manifest.res" test_mips.dir\Debug\test_mips_manifest.rc 

LinkEmbedManifest:

  C:\Program Files (x86)\Microsoft Visual Studio 10.0\VC\bin\link.exe /ERRORREPORT:QUEUE /OUT:"C:\yegor\buildslave\cs-next-msvc2010-32\build\Debug\test_mips.exe" /INCREMENTAL /NOLOGO kernel32.lib user32.lib gdi32.lib winspool.lib shell32.lib ole32.lib oleaut32.lib uuid.lib comdlg32.lib advapi32.lib Debug\capstone.lib /MANIFEST /ManifestFile:"test_mips.dir\Debug\test_mips.exe.intermediate.manifest" /MANIFESTUAC:"level='asInvoker' uiAccess='false'" /DEBUG /PDB:"C:/yegor/buildslave/cs-next-msvc2010-32/build/Debug/test_mips.pdb" /SUBSYSTEM:CONSOLE /TLBID:1 /DYNAMICBASE /NXCOMPAT /IMPLIB:"C:/yegor/buildslave/cs-next-msvc2010-32/build/Debug/test_mips.lib" /MACHINE:X86 test_mips.dir\Debug\test_mips.exe.embed.manifest.res

  test_mips.dir\Debug\test_mips.obj  /machine:X86 /debug 

  test_mips.vcxproj -> C:\yegor\buildslave\cs-next-msvc2010-32\build\Debug\test_mips.exe

FinalizeBuildStatus:

  Deleting file "test_mips.dir\Debug\test_mips.unsuccessfulbuild".

  Touching "test_mips.dir\Debug\test_mips.lastbuildstate".

Done Building Project "C:\yegor\buildslave\cs-next-msvc2010-32\build\test_mips.vcxproj" (default targets).

Project "C:\yegor\buildslave\cs-next-msvc2010-32\build\ALL_BUILD.vcxproj" (1) is building "C:\yegor\buildslave\cs-next-msvc2010-32\build\test_ppc.vcxproj" (15) on node 1 (default targets).

PrepareForBuild:

  Creating directory "test_ppc.dir\Debug\".

InitializeBuildStatus:

  Creating "test_ppc.dir\Debug\test_ppc.unsuccessfulbuild" because "AlwaysCreate" was specified.

CustomBuild:

  Building Custom Rule C:/yegor/buildslave/cs-next-msvc2010-32/capstone/CMakeLists.txt

  CMake does not need to re-run because C:\yegor\buildslave\cs-next-msvc2010-32\build\CMakeFiles\generate.stamp is up-to-date.

ClCompile:

  C:\Program Files (x86)\Microsoft Visual Studio 10.0\VC\bin\CL.exe /c /I"C:\yegor\buildslave\cs-next-msvc2010-32\capstone\include" /Zi /nologo /W3 /WX- /Od /Ob0 /Oy- /D WIN32 /D _WINDOWS /D _DEBUG /D CAPSTONE_ARM_SUPPORT /D CAPSTONE_ARM64_SUPPORT /D CAPSTONE_M68K_SUPPORT /D CAPSTONE_MIPS_SUPPORT /D CAPSTONE_PPC_SUPPORT /D CAPSTONE_SPARC_SUPPORT /D CAPSTONE_SYSZ_SUPPORT /D CAPSTONE_XCORE_SUPPORT /D CAPSTONE_X86_SUPPORT /D CAPSTONE_USE_SYS_DYN_MEM /D CAPSTONE_HAS_ARM /D CAPSTONE_HAS_ARM64 /D CAPSTONE_HAS_MIPS /D CAPSTONE_HAS_POWERPC /D CAPSTONE_HAS_X86 /D CAPSTONE_HAS_SPARC /D CAPSTONE_HAS_SYSZ /D CAPSTONE_HAS_XCORE /D CAPSTONE_HAS_M68K /D "CMAKE_INTDIR=\"Debug\"" /D _MBCS /Gm- /RTC1 /MDd /GS /fp:precise /Zc:wchar_t /Zc:forScope /Fo"test_ppc.dir\Debug\\" /Fd"test_ppc.dir\Debug\vc100.pdb" /Gd /TC /analyze- /errorReport:queue ..\capstone\tests\test_ppc.c

  test_ppc.c

ManifestResourceCompile:

  C:\Program Files (x86)\Microsoft SDKs\Windows\v7.0A\bin\rc.exe /nologo /fo"test_ppc.dir\Debug\test_ppc.exe.embed.manifest.res" test_ppc.dir\Debug\test_ppc_manifest.rc 

Link:

  C:\Program Files (x86)\Microsoft Visual Studio 10.0\VC\bin\link.exe /ERRORREPORT:QUEUE /OUT:"C:\yegor\buildslave\cs-next-msvc2010-32\build\Debug\test_ppc.exe" /INCREMENTAL /NOLOGO kernel32.lib user32.lib gdi32.lib winspool.lib shell32.lib ole32.lib oleaut32.lib uuid.lib comdlg32.lib advapi32.lib Debug\capstone.lib /MANIFEST /ManifestFile:"test_ppc.dir\Debug\test_ppc.exe.intermediate.manifest" /MANIFESTUAC:"level='asInvoker' uiAccess='false'" /DEBUG /PDB:"C:/yegor/buildslave/cs-next-msvc2010-32/build/Debug/test_ppc.pdb" /SUBSYSTEM:CONSOLE /TLBID:1 /DYNAMICBASE /NXCOMPAT /IMPLIB:"C:/yegor/buildslave/cs-next-msvc2010-32/build/Debug/test_ppc.lib" /MACHINE:X86 test_ppc.dir\Debug\test_ppc.exe.embed.manifest.res

  test_ppc.dir\Debug\test_ppc.obj  /machine:X86 /debug 

Manifest:

  C:\Program Files (x86)\Microsoft SDKs\Windows\v7.0A\bin\mt.exe /nologo /verbose /out:"test_ppc.dir\Debug\test_ppc.exe.embed.manifest" /manifest test_ppc.dir\Debug\test_ppc.exe.intermediate.manifest

  C:\Program Files (x86)\Microsoft SDKs\Windows\v7.0A\bin\rc.exe /nologo /fo"test_ppc.dir\Debug\test_ppc.exe.embed.manifest.res" test_ppc.dir\Debug\test_ppc_manifest.rc 

LinkEmbedManifest:

  C:\Program Files (x86)\Microsoft Visual Studio 10.0\VC\bin\link.exe /ERRORREPORT:QUEUE /OUT:"C:\yegor\buildslave\cs-next-msvc2010-32\build\Debug\test_ppc.exe" /INCREMENTAL /NOLOGO kernel32.lib user32.lib gdi32.lib winspool.lib shell32.lib ole32.lib oleaut32.lib uuid.lib comdlg32.lib advapi32.lib Debug\capstone.lib /MANIFEST /ManifestFile:"test_ppc.dir\Debug\test_ppc.exe.intermediate.manifest" /MANIFESTUAC:"level='asInvoker' uiAccess='false'" /DEBUG /PDB:"C:/yegor/buildslave/cs-next-msvc2010-32/build/Debug/test_ppc.pdb" /SUBSYSTEM:CONSOLE /TLBID:1 /DYNAMICBASE /NXCOMPAT /IMPLIB:"C:/yegor/buildslave/cs-next-msvc2010-32/build/Debug/test_ppc.lib" /MACHINE:X86 test_ppc.dir\Debug\test_ppc.exe.embed.manifest.res

  test_ppc.dir\Debug\test_ppc.obj  /machine:X86 /debug 

  test_ppc.vcxproj -> C:\yegor\buildslave\cs-next-msvc2010-32\build\Debug\test_ppc.exe

FinalizeBuildStatus:

  Deleting file "test_ppc.dir\Debug\test_ppc.unsuccessfulbuild".

  Touching "test_ppc.dir\Debug\test_ppc.lastbuildstate".

Done Building Project "C:\yegor\buildslave\cs-next-msvc2010-32\build\test_ppc.vcxproj" (default targets).

Project "C:\yegor\buildslave\cs-next-msvc2010-32\build\ALL_BUILD.vcxproj" (1) is building "C:\yegor\buildslave\cs-next-msvc2010-32\build\test_skipdata.vcxproj" (16) on node 1 (default targets).

PrepareForBuild:

  Creating directory "test_skipdata.dir\Debug\".

InitializeBuildStatus:

  Creating "test_skipdata.dir\Debug\test_skipdata.unsuccessfulbuild" because "AlwaysCreate" was specified.

CustomBuild:

  Building Custom Rule C:/yegor/buildslave/cs-next-msvc2010-32/capstone/CMakeLists.txt

  CMake does not need to re-run because C:\yegor\buildslave\cs-next-msvc2010-32\build\CMakeFiles\generate.stamp is up-to-date.

ClCompile:

  C:\Program Files (x86)\Microsoft Visual Studio 10.0\VC\bin\CL.exe /c /I"C:\yegor\buildslave\cs-next-msvc2010-32\capstone\include" /Zi /nologo /W3 /WX- /Od /Ob0 /Oy- /D WIN32 /D _WINDOWS /D _DEBUG /D CAPSTONE_ARM_SUPPORT /D CAPSTONE_ARM64_SUPPORT /D CAPSTONE_M68K_SUPPORT /D CAPSTONE_MIPS_SUPPORT /D CAPSTONE_PPC_SUPPORT /D CAPSTONE_SPARC_SUPPORT /D CAPSTONE_SYSZ_SUPPORT /D CAPSTONE_XCORE_SUPPORT /D CAPSTONE_X86_SUPPORT /D CAPSTONE_USE_SYS_DYN_MEM /D CAPSTONE_HAS_ARM /D CAPSTONE_HAS_ARM64 /D CAPSTONE_HAS_MIPS /D CAPSTONE_HAS_POWERPC /D CAPSTONE_HAS_X86 /D CAPSTONE_HAS_SPARC /D CAPSTONE_HAS_SYSZ /D CAPSTONE_HAS_XCORE /D CAPSTONE_HAS_M68K /D "CMAKE_INTDIR=\"Debug\"" /D _MBCS /Gm- /RTC1 /MDd /GS /fp:precise /Zc:wchar_t /Zc:forScope /Fo"test_skipdata.dir\Debug\\" /Fd"test_skipdata.dir\Debug\vc100.pdb" /Gd /TC /analyze- /errorReport:queue ..\capstone\tests\test_skipdata.c

  test_skipdata.c

ManifestResourceCompile:

  C:\Program Files (x86)\Microsoft SDKs\Windows\v7.0A\bin\rc.exe /nologo /fo"test_skipdata.dir\Debug\test_skipdata.exe.embed.manifest.res" test_skipdata.dir\Debug\test_skipdata_manifest.rc 

Link:

  C:\Program Files (x86)\Microsoft Visual Studio 10.0\VC\bin\link.exe /ERRORREPORT:QUEUE /OUT:"C:\yegor\buildslave\cs-next-msvc2010-32\build\Debug\test_skipdata.exe" /INCREMENTAL /NOLOGO kernel32.lib user32.lib gdi32.lib winspool.lib shell32.lib ole32.lib oleaut32.lib uuid.lib comdlg32.lib advapi32.lib Debug\capstone.lib /MANIFEST /ManifestFile:"test_skipdata.dir\Debug\test_skipdata.exe.intermediate.manifest" /MANIFESTUAC:"level='asInvoker' uiAccess='false'" /DEBUG /PDB:"C:/yegor/buildslave/cs-next-msvc2010-32/build/Debug/test_skipdata.pdb" /SUBSYSTEM:CONSOLE /TLBID:1 /DYNAMICBASE /NXCOMPAT /IMPLIB:"C:/yegor/buildslave/cs-next-msvc2010-32/build/Debug/test_skipdata.lib" /MACHINE:X86 test_skipdata.dir\Debug\test_skipdata.exe.embed.manifest.res

  test_skipdata.dir\Debug\test_skipdata.obj  /machine:X86 /debug 

Manifest:

  C:\Program Files (x86)\Microsoft SDKs\Windows\v7.0A\bin\mt.exe /nologo /verbose /out:"test_skipdata.dir\Debug\test_skipdata.exe.embed.manifest" /manifest test_skipdata.dir\Debug\test_skipdata.exe.intermediate.manifest

  C:\Program Files (x86)\Microsoft SDKs\Windows\v7.0A\bin\rc.exe /nologo /fo"test_skipdata.dir\Debug\test_skipdata.exe.embed.manifest.res" test_skipdata.dir\Debug\test_skipdata_manifest.rc 

LinkEmbedManifest:

  C:\Program Files (x86)\Microsoft Visual Studio 10.0\VC\bin\link.exe /ERRORREPORT:QUEUE /OUT:"C:\yegor\buildslave\cs-next-msvc2010-32\build\Debug\test_skipdata.exe" /INCREMENTAL /NOLOGO kernel32.lib user32.lib gdi32.lib winspool.lib shell32.lib ole32.lib oleaut32.lib uuid.lib comdlg32.lib advapi32.lib Debug\capstone.lib /MANIFEST /ManifestFile:"test_skipdata.dir\Debug\test_skipdata.exe.intermediate.manifest" /MANIFESTUAC:"level='asInvoker' uiAccess='false'" /DEBUG /PDB:"C:/yegor/buildslave/cs-next-msvc2010-32/build/Debug/test_skipdata.pdb" /SUBSYSTEM:CONSOLE /TLBID:1 /DYNAMICBASE /NXCOMPAT /IMPLIB:"C:/yegor/buildslave/cs-next-msvc2010-32/build/Debug/test_skipdata.lib" /MACHINE:X86 test_skipdata.dir\Debug\test_skipdata.exe.embed.manifest.res

  test_skipdata.dir\Debug\test_skipdata.obj  /machine:X86 /debug 

  test_skipdata.vcxproj -> C:\yegor\buildslave\cs-next-msvc2010-32\build\Debug\test_skipdata.exe

FinalizeBuildStatus:

  Deleting file "test_skipdata.dir\Debug\test_skipdata.unsuccessfulbuild".

  Touching "test_skipdata.dir\Debug\test_skipdata.lastbuildstate".

Done Building Project "C:\yegor\buildslave\cs-next-msvc2010-32\build\test_skipdata.vcxproj" (default targets).

Project "C:\yegor\buildslave\cs-next-msvc2010-32\build\ALL_BUILD.vcxproj" (1) is building "C:\yegor\buildslave\cs-next-msvc2010-32\build\test_sparc.vcxproj" (17) on node 1 (default targets).

PrepareForBuild:

  Creating directory "test_sparc.dir\Debug\".

InitializeBuildStatus:

  Creating "test_sparc.dir\Debug\test_sparc.unsuccessfulbuild" because "AlwaysCreate" was specified.

CustomBuild:

  Building Custom Rule C:/yegor/buildslave/cs-next-msvc2010-32/capstone/CMakeLists.txt

  CMake does not need to re-run because C:\yegor\buildslave\cs-next-msvc2010-32\build\CMakeFiles\generate.stamp is up-to-date.

ClCompile:

  C:\Program Files (x86)\Microsoft Visual Studio 10.0\VC\bin\CL.exe /c /I"C:\yegor\buildslave\cs-next-msvc2010-32\capstone\include" /Zi /nologo /W3 /WX- /Od /Ob0 /Oy- /D WIN32 /D _WINDOWS /D _DEBUG /D CAPSTONE_ARM_SUPPORT /D CAPSTONE_ARM64_SUPPORT /D CAPSTONE_M68K_SUPPORT /D CAPSTONE_MIPS_SUPPORT /D CAPSTONE_PPC_SUPPORT /D CAPSTONE_SPARC_SUPPORT /D CAPSTONE_SYSZ_SUPPORT /D CAPSTONE_XCORE_SUPPORT /D CAPSTONE_X86_SUPPORT /D CAPSTONE_USE_SYS_DYN_MEM /D CAPSTONE_HAS_ARM /D CAPSTONE_HAS_ARM64 /D CAPSTONE_HAS_MIPS /D CAPSTONE_HAS_POWERPC /D CAPSTONE_HAS_X86 /D CAPSTONE_HAS_SPARC /D CAPSTONE_HAS_SYSZ /D CAPSTONE_HAS_XCORE /D CAPSTONE_HAS_M68K /D "CMAKE_INTDIR=\"Debug\"" /D _MBCS /Gm- /RTC1 /MDd /GS /fp:precise /Zc:wchar_t /Zc:forScope /Fo"test_sparc.dir\Debug\\" /Fd"test_sparc.dir\Debug\vc100.pdb" /Gd /TC /analyze- /errorReport:queue ..\capstone\tests\test_sparc.c

  test_sparc.c

ManifestResourceCompile:

  C:\Program Files (x86)\Microsoft SDKs\Windows\v7.0A\bin\rc.exe /nologo /fo"test_sparc.dir\Debug\test_sparc.exe.embed.manifest.res" test_sparc.dir\Debug\test_sparc_manifest.rc 

Link:

  C:\Program Files (x86)\Microsoft Visual Studio 10.0\VC\bin\link.exe /ERRORREPORT:QUEUE /OUT:"C:\yegor\buildslave\cs-next-msvc2010-32\build\Debug\test_sparc.exe" /INCREMENTAL /NOLOGO kernel32.lib user32.lib gdi32.lib winspool.lib shell32.lib ole32.lib oleaut32.lib uuid.lib comdlg32.lib advapi32.lib Debug\capstone.lib /MANIFEST /ManifestFile:"test_sparc.dir\Debug\test_sparc.exe.intermediate.manifest" /MANIFESTUAC:"level='asInvoker' uiAccess='false'" /DEBUG /PDB:"C:/yegor/buildslave/cs-next-msvc2010-32/build/Debug/test_sparc.pdb" /SUBSYSTEM:CONSOLE /TLBID:1 /DYNAMICBASE /NXCOMPAT /IMPLIB:"C:/yegor/buildslave/cs-next-msvc2010-32/build/Debug/test_sparc.lib" /MACHINE:X86 test_sparc.dir\Debug\test_sparc.exe.embed.manifest.res

  test_sparc.dir\Debug\test_sparc.obj  /machine:X86 /debug 

Manifest:

  C:\Program Files (x86)\Microsoft SDKs\Windows\v7.0A\bin\mt.exe /nologo /verbose /out:"test_sparc.dir\Debug\test_sparc.exe.embed.manifest" /manifest test_sparc.dir\Debug\test_sparc.exe.intermediate.manifest

  C:\Program Files (x86)\Microsoft SDKs\Windows\v7.0A\bin\rc.exe /nologo /fo"test_sparc.dir\Debug\test_sparc.exe.embed.manifest.res" test_sparc.dir\Debug\test_sparc_manifest.rc 

LinkEmbedManifest:

  C:\Program Files (x86)\Microsoft Visual Studio 10.0\VC\bin\link.exe /ERRORREPORT:QUEUE /OUT:"C:\yegor\buildslave\cs-next-msvc2010-32\build\Debug\test_sparc.exe" /INCREMENTAL /NOLOGO kernel32.lib user32.lib gdi32.lib winspool.lib shell32.lib ole32.lib oleaut32.lib uuid.lib comdlg32.lib advapi32.lib Debug\capstone.lib /MANIFEST /ManifestFile:"test_sparc.dir\Debug\test_sparc.exe.intermediate.manifest" /MANIFESTUAC:"level='asInvoker' uiAccess='false'" /DEBUG /PDB:"C:/yegor/buildslave/cs-next-msvc2010-32/build/Debug/test_sparc.pdb" /SUBSYSTEM:CONSOLE /TLBID:1 /DYNAMICBASE /NXCOMPAT /IMPLIB:"C:/yegor/buildslave/cs-next-msvc2010-32/build/Debug/test_sparc.lib" /MACHINE:X86 test_sparc.dir\Debug\test_sparc.exe.embed.manifest.res

  test_sparc.dir\Debug\test_sparc.obj  /machine:X86 /debug 

  test_sparc.vcxproj -> C:\yegor\buildslave\cs-next-msvc2010-32\build\Debug\test_sparc.exe

FinalizeBuildStatus:

  Deleting file "test_sparc.dir\Debug\test_sparc.unsuccessfulbuild".

  Touching "test_sparc.dir\Debug\test_sparc.lastbuildstate".

Done Building Project "C:\yegor\buildslave\cs-next-msvc2010-32\build\test_sparc.vcxproj" (default targets).

Project "C:\yegor\buildslave\cs-next-msvc2010-32\build\ALL_BUILD.vcxproj" (1) is building "C:\yegor\buildslave\cs-next-msvc2010-32\build\test_systemz.vcxproj" (18) on node 1 (default targets).

PrepareForBuild:

  Creating directory "test_systemz.dir\Debug\".

InitializeBuildStatus:

  Creating "test_systemz.dir\Debug\test_systemz.unsuccessfulbuild" because "AlwaysCreate" was specified.

CustomBuild:

  Building Custom Rule C:/yegor/buildslave/cs-next-msvc2010-32/capstone/CMakeLists.txt

  CMake does not need to re-run because C:\yegor\buildslave\cs-next-msvc2010-32\build\CMakeFiles\generate.stamp is up-to-date.

ClCompile:

  C:\Program Files (x86)\Microsoft Visual Studio 10.0\VC\bin\CL.exe /c /I"C:\yegor\buildslave\cs-next-msvc2010-32\capstone\include" /Zi /nologo /W3 /WX- /Od /Ob0 /Oy- /D WIN32 /D _WINDOWS /D _DEBUG /D CAPSTONE_ARM_SUPPORT /D CAPSTONE_ARM64_SUPPORT /D CAPSTONE_M68K_SUPPORT /D CAPSTONE_MIPS_SUPPORT /D CAPSTONE_PPC_SUPPORT /D CAPSTONE_SPARC_SUPPORT /D CAPSTONE_SYSZ_SUPPORT /D CAPSTONE_XCORE_SUPPORT /D CAPSTONE_X86_SUPPORT /D CAPSTONE_USE_SYS_DYN_MEM /D CAPSTONE_HAS_ARM /D CAPSTONE_HAS_ARM64 /D CAPSTONE_HAS_MIPS /D CAPSTONE_HAS_POWERPC /D CAPSTONE_HAS_X86 /D CAPSTONE_HAS_SPARC /D CAPSTONE_HAS_SYSZ /D CAPSTONE_HAS_XCORE /D CAPSTONE_HAS_M68K /D "CMAKE_INTDIR=\"Debug\"" /D _MBCS /Gm- /RTC1 /MDd /GS /fp:precise /Zc:wchar_t /Zc:forScope /Fo"test_systemz.dir\Debug\\" /Fd"test_systemz.dir\Debug\vc100.pdb" /Gd /TC /analyze- /errorReport:queue ..\capstone\tests\test_systemz.c

  test_systemz.c

ManifestResourceCompile:

  C:\Program Files (x86)\Microsoft SDKs\Windows\v7.0A\bin\rc.exe /nologo /fo"test_systemz.dir\Debug\test_systemz.exe.embed.manifest.res" test_systemz.dir\Debug\test_systemz_manifest.rc 

Link:

  C:\Program Files (x86)\Microsoft Visual Studio 10.0\VC\bin\link.exe /ERRORREPORT:QUEUE /OUT:"C:\yegor\buildslave\cs-next-msvc2010-32\build\Debug\test_systemz.exe" /INCREMENTAL /NOLOGO kernel32.lib user32.lib gdi32.lib winspool.lib shell32.lib ole32.lib oleaut32.lib uuid.lib comdlg32.lib advapi32.lib Debug\capstone.lib /MANIFEST /ManifestFile:"test_systemz.dir\Debug\test_systemz.exe.intermediate.manifest" /MANIFESTUAC:"level='asInvoker' uiAccess='false'" /DEBUG /PDB:"C:/yegor/buildslave/cs-next-msvc2010-32/build/Debug/test_systemz.pdb" /SUBSYSTEM:CONSOLE /TLBID:1 /DYNAMICBASE /NXCOMPAT /IMPLIB:"C:/yegor/buildslave/cs-next-msvc2010-32/build/Debug/test_systemz.lib" /MACHINE:X86 test_systemz.dir\Debug\test_systemz.exe.embed.manifest.res

  test_systemz.dir\Debug\test_systemz.obj  /machine:X86 /debug 

Manifest:

  C:\Program Files (x86)\Microsoft SDKs\Windows\v7.0A\bin\mt.exe /nologo /verbose /out:"test_systemz.dir\Debug\test_systemz.exe.embed.manifest" /manifest test_systemz.dir\Debug\test_systemz.exe.intermediate.manifest

  C:\Program Files (x86)\Microsoft SDKs\Windows\v7.0A\bin\rc.exe /nologo /fo"test_systemz.dir\Debug\test_systemz.exe.embed.manifest.res" test_systemz.dir\Debug\test_systemz_manifest.rc 

LinkEmbedManifest:

  C:\Program Files (x86)\Microsoft Visual Studio 10.0\VC\bin\link.exe /ERRORREPORT:QUEUE /OUT:"C:\yegor\buildslave\cs-next-msvc2010-32\build\Debug\test_systemz.exe" /INCREMENTAL /NOLOGO kernel32.lib user32.lib gdi32.lib winspool.lib shell32.lib ole32.lib oleaut32.lib uuid.lib comdlg32.lib advapi32.lib Debug\capstone.lib /MANIFEST /ManifestFile:"test_systemz.dir\Debug\test_systemz.exe.intermediate.manifest" /MANIFESTUAC:"level='asInvoker' uiAccess='false'" /DEBUG /PDB:"C:/yegor/buildslave/cs-next-msvc2010-32/build/Debug/test_systemz.pdb" /SUBSYSTEM:CONSOLE /TLBID:1 /DYNAMICBASE /NXCOMPAT /IMPLIB:"C:/yegor/buildslave/cs-next-msvc2010-32/build/Debug/test_systemz.lib" /MACHINE:X86 test_systemz.dir\Debug\test_systemz.exe.embed.manifest.res

  test_systemz.dir\Debug\test_systemz.obj  /machine:X86 /debug 

  test_systemz.vcxproj -> C:\yegor\buildslave\cs-next-msvc2010-32\build\Debug\test_systemz.exe

FinalizeBuildStatus:

  Deleting file "test_systemz.dir\Debug\test_systemz.unsuccessfulbuild".

  Touching "test_systemz.dir\Debug\test_systemz.lastbuildstate".

Done Building Project "C:\yegor\buildslave\cs-next-msvc2010-32\build\test_systemz.vcxproj" (default targets).

Project "C:\yegor\buildslave\cs-next-msvc2010-32\build\ALL_BUILD.vcxproj" (1) is building "C:\yegor\buildslave\cs-next-msvc2010-32\build\test_x86.vcxproj" (19) on node 1 (default targets).

PrepareForBuild:

  Creating directory "test_x86.dir\Debug\".

InitializeBuildStatus:

  Creating "test_x86.dir\Debug\test_x86.unsuccessfulbuild" because "AlwaysCreate" was specified.

CustomBuild:

  Building Custom Rule C:/yegor/buildslave/cs-next-msvc2010-32/capstone/CMakeLists.txt

  CMake does not need to re-run because C:\yegor\buildslave\cs-next-msvc2010-32\build\CMakeFiles\generate.stamp is up-to-date.

ClCompile:

  C:\Program Files (x86)\Microsoft Visual Studio 10.0\VC\bin\CL.exe /c /I"C:\yegor\buildslave\cs-next-msvc2010-32\capstone\include" /Zi /nologo /W3 /WX- /Od /Ob0 /Oy- /D WIN32 /D _WINDOWS /D _DEBUG /D CAPSTONE_ARM_SUPPORT /D CAPSTONE_ARM64_SUPPORT /D CAPSTONE_M68K_SUPPORT /D CAPSTONE_MIPS_SUPPORT /D CAPSTONE_PPC_SUPPORT /D CAPSTONE_SPARC_SUPPORT /D CAPSTONE_SYSZ_SUPPORT /D CAPSTONE_XCORE_SUPPORT /D CAPSTONE_X86_SUPPORT /D CAPSTONE_USE_SYS_DYN_MEM /D CAPSTONE_HAS_ARM /D CAPSTONE_HAS_ARM64 /D CAPSTONE_HAS_MIPS /D CAPSTONE_HAS_POWERPC /D CAPSTONE_HAS_X86 /D CAPSTONE_HAS_SPARC /D CAPSTONE_HAS_SYSZ /D CAPSTONE_HAS_XCORE /D CAPSTONE_HAS_M68K /D "CMAKE_INTDIR=\"Debug\"" /D _MBCS /Gm- /RTC1 /MDd /GS /fp:precise /Zc:wchar_t /Zc:forScope /Fo"test_x86.dir\Debug\\" /Fd"test_x86.dir\Debug\vc100.pdb" /Gd /TC /analyze- /errorReport:queue ..\capstone\tests\test_x86.c

  test_x86.c

ManifestResourceCompile:

  C:\Program Files (x86)\Microsoft SDKs\Windows\v7.0A\bin\rc.exe /nologo /fo"test_x86.dir\Debug\test_x86.exe.embed.manifest.res" test_x86.dir\Debug\test_x86_manifest.rc 

Link:

  C:\Program Files (x86)\Microsoft Visual Studio 10.0\VC\bin\link.exe /ERRORREPORT:QUEUE /OUT:"C:\yegor\buildslave\cs-next-msvc2010-32\build\Debug\test_x86.exe" /INCREMENTAL /NOLOGO kernel32.lib user32.lib gdi32.lib winspool.lib shell32.lib ole32.lib oleaut32.lib uuid.lib comdlg32.lib advapi32.lib Debug\capstone.lib /MANIFEST /ManifestFile:"test_x86.dir\Debug\test_x86.exe.intermediate.manifest" /MANIFESTUAC:"level='asInvoker' uiAccess='false'" /DEBUG /PDB:"C:/yegor/buildslave/cs-next-msvc2010-32/build/Debug/test_x86.pdb" /SUBSYSTEM:CONSOLE /TLBID:1 /DYNAMICBASE /NXCOMPAT /IMPLIB:"C:/yegor/buildslave/cs-next-msvc2010-32/build/Debug/test_x86.lib" /MACHINE:X86 test_x86.dir\Debug\test_x86.exe.embed.manifest.res

  test_x86.dir\Debug\test_x86.obj  /machine:X86 /debug 

Manifest:

  C:\Program Files (x86)\Microsoft SDKs\Windows\v7.0A\bin\mt.exe /nologo /verbose /out:"test_x86.dir\Debug\test_x86.exe.embed.manifest" /manifest test_x86.dir\Debug\test_x86.exe.intermediate.manifest

  C:\Program Files (x86)\Microsoft SDKs\Windows\v7.0A\bin\rc.exe /nologo /fo"test_x86.dir\Debug\test_x86.exe.embed.manifest.res" test_x86.dir\Debug\test_x86_manifest.rc 

LinkEmbedManifest:

  C:\Program Files (x86)\Microsoft Visual Studio 10.0\VC\bin\link.exe /ERRORREPORT:QUEUE /OUT:"C:\yegor\buildslave\cs-next-msvc2010-32\build\Debug\test_x86.exe" /INCREMENTAL /NOLOGO kernel32.lib user32.lib gdi32.lib winspool.lib shell32.lib ole32.lib oleaut32.lib uuid.lib comdlg32.lib advapi32.lib Debug\capstone.lib /MANIFEST /ManifestFile:"test_x86.dir\Debug\test_x86.exe.intermediate.manifest" /MANIFESTUAC:"level='asInvoker' uiAccess='false'" /DEBUG /PDB:"C:/yegor/buildslave/cs-next-msvc2010-32/build/Debug/test_x86.pdb" /SUBSYSTEM:CONSOLE /TLBID:1 /DYNAMICBASE /NXCOMPAT /IMPLIB:"C:/yegor/buildslave/cs-next-msvc2010-32/build/Debug/test_x86.lib" /MACHINE:X86 test_x86.dir\Debug\test_x86.exe.embed.manifest.res

  test_x86.dir\Debug\test_x86.obj  /machine:X86 /debug 

  test_x86.vcxproj -> C:\yegor\buildslave\cs-next-msvc2010-32\build\Debug\test_x86.exe

FinalizeBuildStatus:

  Deleting file "test_x86.dir\Debug\test_x86.unsuccessfulbuild".

  Touching "test_x86.dir\Debug\test_x86.lastbuildstate".

Done Building Project "C:\yegor\buildslave\cs-next-msvc2010-32\build\test_x86.vcxproj" (default targets).

Project "C:\yegor\buildslave\cs-next-msvc2010-32\build\ALL_BUILD.vcxproj" (1) is building "C:\yegor\buildslave\cs-next-msvc2010-32\build\test_xcore.vcxproj" (20) on node 1 (default targets).

PrepareForBuild:

  Creating directory "test_xcore.dir\Debug\".

InitializeBuildStatus:

  Creating "test_xcore.dir\Debug\test_xcore.unsuccessfulbuild" because "AlwaysCreate" was specified.

CustomBuild:

  Building Custom Rule C:/yegor/buildslave/cs-next-msvc2010-32/capstone/CMakeLists.txt

  CMake does not need to re-run because C:\yegor\buildslave\cs-next-msvc2010-32\build\CMakeFiles\generate.stamp is up-to-date.

ClCompile:

  C:\Program Files (x86)\Microsoft Visual Studio 10.0\VC\bin\CL.exe /c /I"C:\yegor\buildslave\cs-next-msvc2010-32\capstone\include" /Zi /nologo /W3 /WX- /Od /Ob0 /Oy- /D WIN32 /D _WINDOWS /D _DEBUG /D CAPSTONE_ARM_SUPPORT /D CAPSTONE_ARM64_SUPPORT /D CAPSTONE_M68K_SUPPORT /D CAPSTONE_MIPS_SUPPORT /D CAPSTONE_PPC_SUPPORT /D CAPSTONE_SPARC_SUPPORT /D CAPSTONE_SYSZ_SUPPORT /D CAPSTONE_XCORE_SUPPORT /D CAPSTONE_X86_SUPPORT /D CAPSTONE_USE_SYS_DYN_MEM /D CAPSTONE_HAS_ARM /D CAPSTONE_HAS_ARM64 /D CAPSTONE_HAS_MIPS /D CAPSTONE_HAS_POWERPC /D CAPSTONE_HAS_X86 /D CAPSTONE_HAS_SPARC /D CAPSTONE_HAS_SYSZ /D CAPSTONE_HAS_XCORE /D CAPSTONE_HAS_M68K /D "CMAKE_INTDIR=\"Debug\"" /D _MBCS /Gm- /RTC1 /MDd /GS /fp:precise /Zc:wchar_t /Zc:forScope /Fo"test_xcore.dir\Debug\\" /Fd"test_xcore.dir\Debug\vc100.pdb" /Gd /TC /analyze- /errorReport:queue ..\capstone\tests\test_xcore.c

  test_xcore.c

ManifestResourceCompile:

  C:\Program Files (x86)\Microsoft SDKs\Windows\v7.0A\bin\rc.exe /nologo /fo"test_xcore.dir\Debug\test_xcore.exe.embed.manifest.res" test_xcore.dir\Debug\test_xcore_manifest.rc 

Link:

  C:\Program Files (x86)\Microsoft Visual Studio 10.0\VC\bin\link.exe /ERRORREPORT:QUEUE /OUT:"C:\yegor\buildslave\cs-next-msvc2010-32\build\Debug\test_xcore.exe" /INCREMENTAL /NOLOGO kernel32.lib user32.lib gdi32.lib winspool.lib shell32.lib ole32.lib oleaut32.lib uuid.lib comdlg32.lib advapi32.lib Debug\capstone.lib /MANIFEST /ManifestFile:"test_xcore.dir\Debug\test_xcore.exe.intermediate.manifest" /MANIFESTUAC:"level='asInvoker' uiAccess='false'" /DEBUG /PDB:"C:/yegor/buildslave/cs-next-msvc2010-32/build/Debug/test_xcore.pdb" /SUBSYSTEM:CONSOLE /TLBID:1 /DYNAMICBASE /NXCOMPAT /IMPLIB:"C:/yegor/buildslave/cs-next-msvc2010-32/build/Debug/test_xcore.lib" /MACHINE:X86 test_xcore.dir\Debug\test_xcore.exe.embed.manifest.res

  test_xcore.dir\Debug\test_xcore.obj  /machine:X86 /debug 

Manifest:

  C:\Program Files (x86)\Microsoft SDKs\Windows\v7.0A\bin\mt.exe /nologo /verbose /out:"test_xcore.dir\Debug\test_xcore.exe.embed.manifest" /manifest test_xcore.dir\Debug\test_xcore.exe.intermediate.manifest

  C:\Program Files (x86)\Microsoft SDKs\Windows\v7.0A\bin\rc.exe /nologo /fo"test_xcore.dir\Debug\test_xcore.exe.embed.manifest.res" test_xcore.dir\Debug\test_xcore_manifest.rc 

LinkEmbedManifest:

  C:\Program Files (x86)\Microsoft Visual Studio 10.0\VC\bin\link.exe /ERRORREPORT:QUEUE /OUT:"C:\yegor\buildslave\cs-next-msvc2010-32\build\Debug\test_xcore.exe" /INCREMENTAL /NOLOGO kernel32.lib user32.lib gdi32.lib winspool.lib shell32.lib ole32.lib oleaut32.lib uuid.lib comdlg32.lib advapi32.lib Debug\capstone.lib /MANIFEST /ManifestFile:"test_xcore.dir\Debug\test_xcore.exe.intermediate.manifest" /MANIFESTUAC:"level='asInvoker' uiAccess='false'" /DEBUG /PDB:"C:/yegor/buildslave/cs-next-msvc2010-32/build/Debug/test_xcore.pdb" /SUBSYSTEM:CONSOLE /TLBID:1 /DYNAMICBASE /NXCOMPAT /IMPLIB:"C:/yegor/buildslave/cs-next-msvc2010-32/build/Debug/test_xcore.lib" /MACHINE:X86 test_xcore.dir\Debug\test_xcore.exe.embed.manifest.res

  test_xcore.dir\Debug\test_xcore.obj  /machine:X86 /debug 

  test_xcore.vcxproj -> C:\yegor\buildslave\cs-next-msvc2010-32\build\Debug\test_xcore.exe

FinalizeBuildStatus:

  Deleting file "test_xcore.dir\Debug\test_xcore.unsuccessfulbuild".

  Touching "test_xcore.dir\Debug\test_xcore.lastbuildstate".

Done Building Project "C:\yegor\buildslave\cs-next-msvc2010-32\build\test_xcore.vcxproj" (default targets).

Done Building Project "C:\yegor\buildslave\cs-next-msvc2010-32\build\ALL_BUILD.vcxproj" (default targets) -- FAILED.



Build FAILED.



"C:\yegor\buildslave\cs-next-msvc2010-32\build\ALL_BUILD.vcxproj" (default target) (1) ->

"C:\yegor\buildslave\cs-next-msvc2010-32\build\cstool.vcxproj" (default target) (5) ->

(ClCompile target) -> 

  ..\capstone\cstool\cstool.c(3): fatal error C1083: Cannot open include file: 'inttypes.h': No such file or directory [C:\yegor\buildslave\cs-next-msvc2010-32\build\cstool.vcxproj]

  ..\capstone\cstool\cstool_arm64.c(78): error C2275: 'uint8_t' : illegal use of this type as an expression [C:\yegor\buildslave\cs-next-msvc2010-32\build\cstool.vcxproj]

  ..\capstone\cstool\cstool_arm64.c(78): error C2146: syntax error : missing ';' before identifier 'access' [C:\yegor\buildslave\cs-next-msvc2010-32\build\cstool.vcxproj]

  ..\capstone\cstool\cstool_arm64.c(78): error C2065: 'access' : undeclared identifier [C:\yegor\buildslave\cs-next-msvc2010-32\build\cstool.vcxproj]

  ..\capstone\cstool\cstool_arm64.c(79): error C2065: 'access' : undeclared identifier [C:\yegor\buildslave\cs-next-msvc2010-32\build\cstool.vcxproj]

  ..\capstone\cstool\cstool_ppc.c(4): fatal error C1083: Cannot open include file: 'inttypes.h': No such file or directory [C:\yegor\buildslave\cs-next-msvc2010-32\build\cstool.vcxproj]





"C:\yegor\buildslave\cs-next-msvc2010-32\build\ALL_BUILD.vcxproj" (default target) (1) ->

"C:\yegor\buildslave\cs-next-msvc2010-32\build\test_arm64.vcxproj" (default target) (7) ->

  ..\capstone\tests\test_arm64.c(99): error C2275: 'uint8_t' : illegal use of this type as an expression [C:\yegor\buildslave\cs-next-msvc2010-32\build\test_arm64.vcxproj]

  ..\capstone\tests\test_arm64.c(99): error C2146: syntax error : missing ';' before identifier 'access' [C:\yegor\buildslave\cs-next-msvc2010-32\build\test_arm64.vcxproj]

  ..\capstone\tests\test_arm64.c(99): error C2065: 'access' : undeclared identifier [C:\yegor\buildslave\cs-next-msvc2010-32\build\test_arm64.vcxproj]

  ..\capstone\tests\test_arm64.c(100): error C2065: 'access' : undeclared identifier [C:\yegor\buildslave\cs-next-msvc2010-32\build\test_arm64.vcxproj]



    0 Warning(s)

    10 Error(s)



Time Elapsed 00:02:05.81



More information about the Capstone-buildbot mailing list